Sl_No,Date,Age Bracket,Gender,Patient_Status,City,District,State,Statecode,Notes,Nationality,Source_1,Source_2,Source_3,Patient_Number (Could be mapped later)
59,13/03/2020,,,Deceased,,,Karnataka,KA,KA-P6,,Opening Data as of Mar 29,,,P74
54,20/03/2020,,,Recovered,,,Karnataka,KA,KA-P5,,Opening Data as of Mar 29,,,
55,24/03/2020,,,Recovered,,,Karnataka,KA,KA-P2,,Opening Data as of Mar 29,,,
56,24/03/2020,,,Recovered,,,Karnataka,KA,KA-P4,,Opening Data as of Mar 29,,,
60,26/03/2020,,,Deceased,,,Karnataka,KA,KA-P53,,Opening Data as of Mar 29,,,P690
61,27/03/2020,,,Deceased,,,Karnataka,KA,KA-P60,,Opening Data as of Mar 29,,,P758
57,27/03/2020,,,Recovered,,,Karnataka,KA,KA-P1,,Opening Data as of Mar 29,,,
58,27/03/2020,,,Recovered,,,Karnataka,KA,KA-P3,,Opening Data as of Mar 29,,,
1,29/03/2020,85,M,Deceased,Mumbai,Mumbai,Maharashtra,MH,"Suffering from Diabetes, had a pacemaker, no travel history, came in contact with someone who returned from UK",,https://arogya.maharashtra.gov.in/pdf/epressnote31.pdf,https://www.deccanherald.com/national/west/death-toll-of-covid-19-patients-in-mumbai-rises-to-six-as-85-year-old-doctor-confirmed-to-have-died-of-virus-818644.html,,
2,29/03/2020,80,M,Deceased,Mumbai,Mumbai,Maharashtra,MH,"patient passed away at the Fortis Hospital, Mulund on Saturday. He had co-morbid conditions including acute respiratory distress, hypertension and ischemic heart disease. He was admitted to the private hospital on March 27 and died a day later. The deceased tested positive for Covid-19 on March 29, a day after his demise.",,https://arogya.maharashtra.gov.in/pdf/epressnote31.pdf,https://www.indiatoday.in/india/story/coronavirus-in-mumbai-47-new-covid-19-cases-in-city-as-private-lab-data-pours-in-1661482-2020-03-30,,
3,29/03/2020,86,F,Deceased,Ghatkopar,Mumbai Suburban,Maharashtra,MH,,,https://arogya.maharashtra.gov.in/pdf/epressnote31.pdf,,,
4,29/03/2020,,,Deceased,,Mumbai,Maharashtra,MH,,,https://arogya.maharashtra.gov.in/pdf/epressnote31.pdf,,,
5,29/03/2020,,,Deceased,,Mumbai,Maharashtra,MH,,,https://arogya.maharashtra.gov.in/pdf/epressnote31.pdf,,,
6,29/03/2020,,,Deceased,,Thane,Maharashtra,MH,,,https://arogya.maharashtra.gov.in/pdf/epressnote31.pdf,,,
7,29/03/2020,45,M,Deceased,,Buldhana,Maharashtra,MH,The deceased was a diabetic and had no travel history even within the country,,https://arogya.maharashtra.gov.in/pdf/epressnote31.pdf,https://timesofindia.indiatimes.com/city/nagpur/1st-covid-19-death-in-vid-3-more-positive-in-city/articleshow/74879486.cms,,
33,29/03/2020,,,Deceased,,,Kerala,KL,,,Opening Data as of Mar 29,,,
68,29/03/2020,,,Deceased,,,Delhi,DL,,,Opening Data as of Mar 29,,,
69,29/03/2020,,,Deceased,,,Delhi,DL,,,Opening Data as of Mar 29,,,
82,29/03/2020,74,M,Deceased,Hyderabad,Hyderabad,Telangana,TG,Travel history to Delhi and suffering from other ailments. Passed away on 28th April in a private hospital.,,https://www.thehindubusinessline.com/news/first-covid-19-death-in-telangana-6-more-positive-cases/article31193722.ece,,,
83,29/03/2020,67,M,Deceased,Surat,Surat,Gujarat,GJ,"No foreign travel, had visited Delhi and Jaipur earlier. Admitted to Hospital on 17th march with kidney and asthma complications and died on 22nd March",,https://ahmedabadmirror.indiatimes.com/ahmedabad/others/guj-records-1st-covid-19-death/articleshow/74765026.cms,,,P294
84,29/03/2020,85,F,Deceased,Ahmadabad,Ahmedabad,Gujarat,GJ,Returned from Saudi Arabia recently. Died on March 25th.,,https://indianexpress.com/article/cities/ahmedabad/gujarat-85-year-old-woman-is-second-casualty-in-state-6331826/,,,
85,29/03/2020,70,M,Deceased,Bhavnagar,Bhavnagar,Gujarat,GJ,"No foreign travel, flew to Delhi and back from Ahmedabad. Had multiple co-morbid conditions, including cardiomegaly, diabetes, hypertension and malignancy.",,https://indianexpress.com/article/cities/ahmedabad/gujarat-third-death-in-bhavnagar-positive-cases-go-up-to-44-6333601/,,,
86,29/03/2020,46,F,Deceased,Ahmadabad,Ahmedabad,Gujarat,GJ,"No travel history, it may be due to local transmission but we are still trying to trace contact. She was hospitalised on March 26 as she was suffering from breathlessness although she had pulmonary fibrosis for a year, with her lungs only partially functioning died  two days later.",,https://indianexpress.com/article/cities/ahmedabad/covid-19-fourth-death-in-ahmedabad-coronavirus-positive-cases-go-up-to-55-6336521/,,,
87,29/03/2020,47,M,Deceased,Ahmadabad,Ahmedabad,Gujarat,GJ,"Had diabetes, was admitted to SVP hospital",,https://ahmedabadmirror.indiatimes.com/ahmedabad/others/alongside-hope-some-despair-too-gujarat-reports-its-fifth-death/articleshow/74879494.cms,,,
96,29/03/2020,,,Deceased,,,Tamil Nadu,TN,,,Opening Data as of Mar 29,,,
97,29/03/2020,65,M,Deceased,Indore,Indore,Madhya Pradesh,MP,,,Opening Data as of Mar 29,,,
98,29/03/2020,65,F,Deceased,Ujjain,Ujjain,Madhya Pradesh,MP,,,Opening Data as of Mar 29,,,
100,29/03/2020,,,Deceased,,,Jammu and Kashmir,JK,,,Opening Data as of Mar 29,,,
102,29/03/2020,,,Deceased,,,Punjab,PB,,,Opening Data as of Mar 29,,,
121,29/03/2020,57,M,Deceased,Dum Dum,North 24 Parganas,West Bengal,WB,Was in hospital from Feb 16 and no foreign travel. Visited Bilaspur in Feb. Was on ventilator support.,,https://www.telegraphindia.com/states/west-bengal/coronavirus-west-bengal-registers-first-death-all-domestic-flights-cancelled/cid/1758366,,,
122,29/03/2020,38,M,Deceased,,Munger,Bihar,BR,Died on Mar 21st. His test confirmation came a day later.,,https://twitter.com/sanjayjavin/status/1247036903678816259,,,
129,29/03/2020,,,Deceased,,,Himachal Pradesh,HP,,,https://www.indiatvnews.com/news/india/breaking-himachal-pradesh-reports-first-death-due-to-coronavirus-600840,,,
130,29/03/2020,40,F,Deceased,,Mumbai,Maharashtra,MH,"complained of severe respiratory distress, admitted and tested",,https://punemirror.indiatimes.com/pune/others/covid-19-8-deaths-reported-in-maharashtra-203-positive-cases/articleshow/74876872.cms,,,
8,29/03/2020,,,Recovered,,Mumbai,Maharashtra,MH,,,https://twitter.com/rajeshtope11/status/1244629295412047875,,,
9,29/03/2020,,,Recovered,,Mumbai,Maharashtra,MH,,,https://twitter.com/rajeshtope11/status/1244629295412047875,,,
10,29/03/2020,,,Recovered,,Mumbai,Maharashtra,MH,,,https://twitter.com/rajeshtope11/status/1244629295412047875,,,
11,29/03/2020,,,Recovered,,Mumbai,Maharashtra,MH,,,https://twitter.com/rajeshtope11/status/1244629295412047875,,,
12,29/03/2020,,,Recovered,,Mumbai,Maharashtra,MH,,,https://twitter.com/rajeshtope11/status/1244629295412047875,,,
13,29/03/2020,,,Recovered,,Mumbai,Maharashtra,MH,,,https://twitter.com/rajeshtope11/status/1244629295412047875,,,
14,29/03/2020,,,Recovered,,Mumbai,Maharashtra,MH,,,https://twitter.com/rajeshtope11/status/1244629295412047875,,,
15,29/03/2020,,,Recovered,,Mumbai,Maharashtra,MH,,,https://twitter.com/rajeshtope11/status/1244629295412047875,,,
16,29/03/2020,,,Recovered,,Mumbai,Maharashtra,MH,,,https://twitter.com/rajeshtope11/status/1244629295412047875,,,
17,29/03/2020,,,Recovered,,Mumbai,Maharashtra,MH,,,https://twitter.com/rajeshtope11/status/1244629295412047875,,,
18,29/03/2020,,,Recovered,,Mumbai,Maharashtra,MH,,,https://twitter.com/rajeshtope11/status/1244629295412047875,,,
19,29/03/2020,,,Recovered,,Mumbai,Maharashtra,MH,,,https://twitter.com/rajeshtope11/status/1244629295412047875,,,
20,29/03/2020,,,Recovered,,Mumbai,Maharashtra,MH,,,https://twitter.com/rajeshtope11/status/1244629295412047875,,,
21,29/03/2020,,,Recovered,,Mumbai,Maharashtra,MH,,,https://twitter.com/rajeshtope11/status/1244629295412047875,,,
22,29/03/2020,,,Recovered,Pune,Pune,Maharashtra,MH,,,https://twitter.com/rajeshtope11/status/1244629295412047875,,,
23,29/03/2020,,,Recovered,Pune,Pune,Maharashtra,MH,,,https://twitter.com/rajeshtope11/status/1244629295412047875,,,
24,29/03/2020,,,Recovered,Pune,Pune,Maharashtra,MH,,,https://twitter.com/rajeshtope11/status/1244629295412047875,,,
25,29/03/2020,,,Recovered,Pune,Pune,Maharashtra,MH,,,https://twitter.com/rajeshtope11/status/1244629295412047875,,,
26,29/03/2020,,,Recovered,Pune,Pune,Maharashtra,MH,,,https://twitter.com/rajeshtope11/status/1244629295412047875,,,
27,29/03/2020,,,Recovered,Pune,Pune,Maharashtra,MH,,,https://twitter.com/rajeshtope11/status/1244629295412047875,,,
28,29/03/2020,,,Recovered,Pune,Pune,Maharashtra,MH,,,https://twitter.com/rajeshtope11/status/1244629295412047875,,,
29,29/03/2020,,,Recovered,Pimpri-Chinchwad,Pune,Maharashtra,MH,,,https://twitter.com/rajeshtope11/status/1244629295412047875,,,
30,29/03/2020,,,Recovered,Pimpri-Chinchwad,Pune,Maharashtra,MH,,,https://twitter.com/rajeshtope11/status/1244629295412047875,,,
31,29/03/2020,,,Recovered,Pimpri-Chinchwad,Pune,Maharashtra,MH,,,https://twitter.com/rajeshtope11/status/1244629295412047875,,,
32,29/03/2020,,,Recovered,Pimpri-Chinchwad,Pune,Maharashtra,MH,,,https://twitter.com/rajeshtope11/status/1244629295412047875,,,
34,29/03/2020,,,Recovered,,,Kerala,KL,,,Opening Data as of Mar 29,,,
35,29/03/2020,,,Recovered,,,Kerala,KL,,,Opening Data as of Mar 29,,,
36,29/03/2020,,,Recovered,,,Kerala,KL,,,Opening Data as of Mar 29,,,
37,29/03/2020,,,Recovered,,,Kerala,KL,,,Opening Data as of Mar 29,,,
38,29/03/2020,,,Recovered,,,Kerala,KL,,,Opening Data as of Mar 29,,,
39,29/03/2020,,,Recovered,,,Kerala,KL,,,Opening Data as of Mar 29,,,
40,29/03/2020,,,Recovered,,,Kerala,KL,,,Opening Data as of Mar 29,,,
41,29/03/2020,,,Recovered,,,Kerala,KL,,,Opening Data as of Mar 29,,,
42,29/03/2020,,,Recovered,,,Kerala,KL,,,Opening Data as of Mar 29,,,
43,29/03/2020,,,Recovered,,,Kerala,KL,,,Opening Data as of Mar 29,,,
44,29/03/2020,,,Recovered,,,Kerala,KL,,,Opening Data as of Mar 29,,,
45,29/03/2020,,,Recovered,,,Kerala,KL,,,Opening Data as of Mar 29,,,
46,29/03/2020,,,Recovered,,,Kerala,KL,,,Opening Data as of Mar 29,,,
47,29/03/2020,,,Recovered,,,Kerala,KL,,,Opening Data as of Mar 29,,,
48,29/03/2020,,,Recovered,,,Kerala,KL,,,Opening Data as of Mar 29,,,
49,29/03/2020,,,Recovered,,,Kerala,KL,,,Opening Data as of Mar 29,,,
50,29/03/2020,,,Recovered,,,Kerala,KL,,,Opening Data as of Mar 29,,,
51,29/03/2020,,,Recovered,,,Kerala,KL,,,Opening Data as of Mar 29,,,
52,29/03/2020,,,Recovered,,,Kerala,KL,,,Opening Data as of Mar 29,,,
53,29/03/2020,,,Recovered,,,Kerala,KL,,,Opening Data as of Mar 29,,,
62,29/03/2020,,,Recovered,,,Delhi,DL,,,Opening Data as of Mar 29,,,
63,29/03/2020,,,Recovered,,,Delhi,DL,,,Opening Data as of Mar 29,,,
64,29/03/2020,,,Recovered,,,Delhi,DL,,,Opening Data as of Mar 29,,,
65,29/03/2020,,,Recovered,,,Delhi,DL,,,Opening Data as of Mar 29,,,
66,29/03/2020,,,Recovered,,,Delhi,DL,,,Opening Data as of Mar 29,,,
67,29/03/2020,,,Recovered,,,Delhi,DL,,,Opening Data as of Mar 29,,,
70,29/03/2020,,,Recovered,,Agra,Uttar Pradesh,UP,,,Opening Data as of Mar 29,,,
71,29/03/2020,,,Recovered,,Agra,Uttar Pradesh,UP,,,Opening Data as of Mar 29,,,
72,29/03/2020,,,Recovered,,Agra,Uttar Pradesh,UP,,,Opening Data as of Mar 29,,,
73,29/03/2020,,,Recovered,,Agra,Uttar Pradesh,UP,,,Opening Data as of Mar 29,,,
74,29/03/2020,,,Recovered,,Agra,Uttar Pradesh,UP,,,Opening Data as of Mar 29,,,
75,29/03/2020,,,Recovered,,Agra,Uttar Pradesh,UP,,,Opening Data as of Mar 29,,,
76,29/03/2020,,,Recovered,,Agra,Uttar Pradesh,UP,,,Opening Data as of Mar 29,,,
77,29/03/2020,,,Recovered,,Agra,Uttar Pradesh,UP,,,Opening Data as of Mar 29,,,
78,29/03/2020,,,Recovered,,Gautam Buddha Nagar,Uttar Pradesh,UP,,,Opening Data as of Mar 29,,,
79,29/03/2020,,,Recovered,,Gautam Buddha Nagar,Uttar Pradesh,UP,,,Opening Data as of Mar 29,,,
80,29/03/2020,,,Recovered,,Gautam Buddha Nagar,Uttar Pradesh,UP,,,Opening Data as of Mar 29,,,
81,29/03/2020,,,Recovered,,,Telangana,TG,,,Opening Data as of Mar 29,,,
88,29/03/2020,34,F,Recovered,,Ahmedabad,Gujarat,GJ,,,Opening Data as of Mar 29,,,P211
89,29/03/2020,,,Recovered,,,Rajasthan,RJ,,,Opening Data as of Mar 29,,,
90,29/03/2020,,,Recovered,,,Rajasthan,RJ,,,Opening Data as of Mar 29,,,
91,29/03/2020,,,Recovered,,,Rajasthan,RJ,,,Opening Data as of Mar 29,,,
92,29/03/2020,,,Recovered,,,Tamil Nadu,TN,,,Opening Data as of Mar 29,,,
93,29/03/2020,,,Recovered,,,Tamil Nadu,TN,,,Opening Data as of Mar 29,,,
94,29/03/2020,,,Recovered,,,Tamil Nadu,TN,,,Opening Data as of Mar 29,,,
95,29/03/2020,,,Recovered,,,Tamil Nadu,TN,,,Opening Data as of Mar 29,,,
99,29/03/2020,,,Recovered,,,Jammu and Kashmir,JK,,,Opening Data as of Mar 29,,,
101,29/03/2020,,,Recovered,,,Punjab,PB,,,Opening Data as of Mar 29,,,
103,29/03/2020,,,Recovered,,Italians,Haryana,HR,,Italy,Opening Data as of Mar 29,,,
104,29/03/2020,,,Recovered,,Italians,Haryana,HR,,Italy,Opening Data as of Mar 29,,,
105,29/03/2020,,,Recovered,,Italians,Haryana,HR,,Italy,Opening Data as of Mar 29,,,
106,29/03/2020,,,Recovered,,Italians,Haryana,HR,,Italy,Opening Data as of Mar 29,,,
107,29/03/2020,,,Recovered,,Italians,Haryana,HR,,Italy,Opening Data as of Mar 29,,,
108,29/03/2020,,,Recovered,,Italians,Haryana,HR,,Italy,Opening Data as of Mar 29,,,
109,29/03/2020,,,Recovered,,Italians,Haryana,HR,,Italy,Opening Data as of Mar 29,,,
110,29/03/2020,,,Recovered,,Italians,Haryana,HR,,Italy,Opening Data as of Mar 29,,,
111,29/03/2020,,,Recovered,,Italians,Haryana,HR,,Italy,Opening Data as of Mar 29,,,
112,29/03/2020,,,Recovered,,Italians,Haryana,HR,,Italy,Opening Data as of Mar 29,,,
113,29/03/2020,,,Recovered,,Italians,Haryana,HR,,Italy,Opening Data as of Mar 29,,,
114,29/03/2020,,,Recovered,,Italians,Haryana,HR,,Italy,Opening Data as of Mar 29,,,
115,29/03/2020,,,Recovered,,Italians,Haryana,HR,,Italy,Opening Data as of Mar 29,,,
116,29/03/2020,,,Recovered,,Italians,Haryana,HR,,Italy,Opening Data as of Mar 29,,,
120,29/03/2020,,,Recovered,,,Andhra Pradesh,AP,,,Opening Data as of Mar 29,,,
123,29/03/2020,,,Recovered,,,Ladakh,LA,,,Opening Data as of Mar 29,,,
124,29/03/2020,,,Recovered,,,Ladakh,LA,,,Opening Data as of Mar 29,,,
125,29/03/2020,,,Recovered,,,Ladakh,LA,,,Opening Data as of Mar 29,,,
126,29/03/2020,,,Recovered,,,Uttarakhand,UT,,,Opening Data as of Mar 29,,,
127,29/03/2020,,,Recovered,,,Uttarakhand,UT,,,Opening Data as of Mar 29,,,
128,29/03/2020,,,Recovered,,,Himachal Pradesh,HP,,,Opening Data as of Mar 29,,,
131,30/03/2020,44,F,Deceased,Kalimpong,Kalimpong,West Bengal,WB,Had gone to Chennai and returned to Bagdogra by flight on March 19th was having cough and cold. Admitted to NBMCH on 26th March.,,https://www.telegraphindia.com/states/west-bengal/north-bengals-first-covid-patient-dies/cid/1760636?ref=also-read_story-page,,,
132,30/03/2020,45,F,Deceased,Bhavnagar,Bhavnagar,Gujarat,GJ,Had mental ailment and suffered a stroke two weeks back.,,https://twitter.com/PTI_News/status/1244495961319067648?s=20,https://theprint.in/india/gujarat-reports-69-new-coronavirus-cases-death-toll-rises-to-6/391266/,,
133,30/03/2020,52,M,Deceased,,Pune,Maharashtra,MH,"Suffering from Diabetes, Hypertension",,https://www.deccanherald.com/national/west/52-yr-old-covid-19-patient-dies-in-pune-maha-toll-reaches-9-819186.html,,,
134,30/03/2020,62,M,Deceased,,Hoshiarpur,Punjab,PB,Contact of 70yr old first Punjab Covid19 deceased,,https://www.deccanherald.com/national/punjab-reports-second-covid-19-death-62-year-old-man-dies-in-amritsar-cmo-819097.html,,,
157,30/03/2020,69,M,Deceased,Hyderabad,Hyderabad,Telangana,TG,Was on a ventilator at Gandhi hospital and passed away on 30th March.,,https://twitter.com/TelanganaHealth/status/1244652635736559616,https://telanganatoday.com/telangana-reports-six-corona-positive-cases-and-one-death-on-monday,,
171,30/03/2020,78,M,Deceased,,Mumbai,Maharashtra,MH,1 Mumbai; 1 Pune,,https://twitter.com/rajeshtope11/status/1244629166424637442,https://arogya.maharashtra.gov.in/pdf/mpressnote30.pdf,,
172,30/03/2020,,,Deceased,,,Telangana,TG,Need to verify if these patients are part of raw data,,https://twitter.com/telanganacmo/status/1244684114000662528?s=21,,,
173,30/03/2020,,,Deceased,,,Telangana,TG,Need to verify if these patients are part of raw data,,https://twitter.com/telanganacmo/status/1244684114000662528?s=21,,,
174,30/03/2020,,,Deceased,,,Telangana,TG,Need to verify if these patients are part of raw data,,https://twitter.com/telanganacmo/status/1244684114000662528?s=21,,,
175,30/03/2020,56,M,Deceased,Hyderabad,Hyderabad,Telangana,TG,Had comorbid conditions and was admitted in critical condition,,https://twitter.com/telanganacmo/status/1244684114000662528?s=21,https://www.deccanherald.com/national/south/covid-19-patient-attacks-doctors-after-his-nizamuddin-markaz-returned-brother-dies-of-covid-19-820229.html,,
176,30/03/2020,42,F,Deceased,Ludhiana,Ludhiana,Punjab,PB,She was brought to Patiala’s Government Rajindra Hospital with acute respiratory syndrome at 1.30 am on Monday morning.,,https://www.tribuneindia.com/news/ludhiana-woman-dies-of-coronavirus-punjab-toll-3-now-63172,,,
177,30/03/2020,41,M,Deceased,Indore,Indore,Madhya Pradesh,MP,"Diabetic, admitted to pvt hospital on 23rd, tested positive for coronavirus on 26th and passed away on 30.03.20",,https://twitter.com/pti_news/status/1244570963116617731?s=21,https://timesofindia.indiatimes.com/city/indore/madhya-pradesh-reports-fourth-coronavirus-death/articleshow/74893979.cms,,
178,30/03/2020,38,M,Deceased,Ujjain,Ujjain,Madhya Pradesh,MP,"Had high BP, complained of chest pain and looked like a cardiac patient",,https://twitter.com/pti_news/status/1244570963116617731?s=21,https://www.businessinsider.in/india/news/coronavirus-cases-in-mp-madhya-pradesh-news-and-updates/articleshow/74821979.cms,,
117,30/03/2020,,,Recovered,,Gurugram,Haryana,HR,Patient ID unknown,,Opening Data as of Mar 29,http://www.nhmharyana.gov.in/WriteReadData/userfiles/file/CoronaVirus/Media%20Bulletin%20M30-03-2020.pdf,,
118,30/03/2020,,,Recovered,,Gurugram,Haryana,HR,Patient ID unknown,,Opening Data as of Mar 29,http://www.nhmharyana.gov.in/WriteReadData/userfiles/file/CoronaVirus/Media%20Bulletin%20M30-03-2020.pdf,,
119,30/03/2020,,,Recovered,,Gurugram,Haryana,HR,Patient ID unknown,,Opening Data as of Mar 29,http://www.nhmharyana.gov.in/WriteReadData/userfiles/file/CoronaVirus/Media%20Bulletin%20M30-03-2020.pdf,,
135,30/03/2020,62,F,Recovered,,,Gujarat,GJ,Admitted on 20/3/2020,,State bulletin,,,
136,30/03/2020,65,M,Recovered,,,Gujarat,GJ,Admitted on 20/3/2020,,State bulletin,,,
137,30/03/2020,,,Recovered,,Gautam Buddha Nagar,Uttar Pradesh,UP,8 Agra recoveries,,https://twitter.com/ANINewsUP/status/1244627469199486977,,,
138,30/03/2020,,,Recovered,,Gautam Buddha Nagar,Uttar Pradesh,UP,6 NOIDA recoveries,,https://twitter.com/ANINewsUP/status/1244627469199486977,,,
139,30/03/2020,,,Recovered,,Gautam Buddha Nagar,Uttar Pradesh,UP,2 Ghaziabad recoveries,,https://twitter.com/ANINewsUP/status/1244627469199486977,,,
140,30/03/2020,,,Recovered,,Lucknow,Uttar Pradesh,UP,Lucknow,,https://twitter.com/ANINewsUP/status/1244627469199486977,,,
141,30/03/2020,,,Recovered,,Ghaziabad,Uttar Pradesh,UP,Total 17 as of 30 Mar,,https://twitter.com/ANINewsUP/status/1244627469199486977,,,
142,30/03/2020,,,Recovered,,Ghaziabad,Uttar Pradesh,UP,,,https://twitter.com/ANINewsUP/status/1244627469199486977,,,
143,30/03/2020,,,Recovered,Pimpri-Chinchwad,Pune,Maharashtra,MH,14 Mumbai,,https://twitter.com/rajeshtope11/status/1244629295412047875,,,
144,30/03/2020,,,Recovered,Pimpri-Chinchwad,Pune,Maharashtra,MH,7 Pune,,https://twitter.com/rajeshtope11/status/1244629295412047875,,,
145,30/03/2020,,,Recovered,Pimpri-Chinchwad,Pune,Maharashtra,MH,9 Pimpri-Chinchwad,,https://twitter.com/rajeshtope11/status/1244629295412047875,,,
146,30/03/2020,,,Recovered,Pimpri-Chinchwad,Pune,Maharashtra,MH,3 Yavatmal,,https://twitter.com/rajeshtope11/status/1244629295412047875,,,
147,30/03/2020,,,Recovered,Pimpri-Chinchwad,Pune,Maharashtra,MH,4 Nagpur,,https://twitter.com/rajeshtope11/status/1244629295412047875,,,
148,30/03/2020,,,Recovered,,Yavatmal,Maharashtra,MH,,,https://twitter.com/rajeshtope11/status/1244629295412047875,,,
149,30/03/2020,,,Recovered,,Yavatmal,Maharashtra,MH,,,https://twitter.com/rajeshtope11/status/1244629295412047875,,,
150,30/03/2020,,,Recovered,,Yavatmal,Maharashtra,MH,,,https://twitter.com/rajeshtope11/status/1244629295412047875,,,
151,30/03/2020,,,Recovered,,Nagpur,Maharashtra,MH,,,https://twitter.com/rajeshtope11/status/1244629295412047875,,,
152,30/03/2020,,,Recovered,,Nagpur,Maharashtra,MH,,,https://twitter.com/rajeshtope11/status/1244629295412047875,,,
153,30/03/2020,,,Recovered,,Nagpur,Maharashtra,MH,,,https://twitter.com/rajeshtope11/status/1244629295412047875,,,
154,30/03/2020,,,Recovered,,Nagpur,Maharashtra,MH,,,https://twitter.com/rajeshtope11/status/1244629295412047875,,,
155,30/03/2020,,,Recovered,,Ahmednagar,Maharashtra,MH,1 Ahmadnagar,,https://twitter.com/rajeshtope11/status/1244629295412047875,,,
156,30/03/2020,,,Recovered,,Aurangabad,Maharashtra,MH,1 Aurangabad,,https://twitter.com/rajeshtope11/status/1244629295412047875,,,
158,30/03/2020,,,Recovered,,,Telangana,TG,,,https://twitter.com/TelanganaHealth/status/1244652635736559616,,,
159,30/03/2020,,,Recovered,,Hyderabad,Telangana,TG,,,https://twitter.com/TelanganaHealth/status/1244652635736559616,,,
160,30/03/2020,,,Recovered,,,Telangana,TG,,,https://twitter.com/TelanganaHealth/status/1244652635736559616,,,
161,30/03/2020,,,Recovered,,,Telangana,TG,,,https://twitter.com/TelanganaHealth/status/1244652635736559616,,,
162,30/03/2020,,,Recovered,,,Telangana,TG,,,https://twitter.com/TelanganaHealth/status/1244652635736559616,,,
163,30/03/2020,,,Recovered,,,Telangana,TG,,,https://twitter.com/TelanganaHealth/status/1244652635736559616,,,
164,30/03/2020,,,Recovered,,,Telangana,TG,,,https://twitter.com/TelanganaHealth/status/1244652635736559616,,,
165,30/03/2020,,,Recovered,,,Telangana,TG,,,https://twitter.com/TelanganaHealth/status/1244652635736559616,,,
166,30/03/2020,,,Recovered,,,Telangana,TG,,,https://twitter.com/TelanganaHealth/status/1244652635736559616,,,
167,30/03/2020,,,Recovered,,,Telangana,TG,,,https://twitter.com/TelanganaHealth/status/1244652635736559616,,,
168,30/03/2020,,,Recovered,,,Telangana,TG,,,https://twitter.com/TelanganaHealth/status/1244652635736559616,,,
169,30/03/2020,,,Recovered,,,Telangana,TG,,,https://twitter.com/TelanganaHealth/status/1244652635736559616,,,
170,30/03/2020,,,Recovered,,,Telangana,TG,,,https://twitter.com/TelanganaHealth/status/1244652635736559616,,,
179,30/03/2020,,,Recovered,,,Karnataka,KA,KA-P12,,State bulletin,,,P136
212,30/03/2020,,,Recovered,,Gurugram,Haryana,HR,6 discharges as of 30 Mar,,http://www.nhmharyana.gov.in/WriteReadData/userfiles/file/CoronaVirus/Media%20Bulletin%20M30-03-2020.pdf,,,
213,30/03/2020,,,Recovered,,Gurugram,Haryana,HR,6 discharges as of 30 Mar,,http://www.nhmharyana.gov.in/WriteReadData/userfiles/file/CoronaVirus/Media%20Bulletin%20M30-03-2020.pdf,,,
214,30/03/2020,,,Recovered,,Gurugram,Haryana,HR,6 discharges as of 30 Mar,,http://www.nhmharyana.gov.in/WriteReadData/userfiles/file/CoronaVirus/Media%20Bulletin%20M30-03-2020.pdf,,,
180,31/03/2020,68,M,Deceased,,Thiruvananthapuram,Kerala,KL,P1449,,https://twitter.com/ANI/status/1244825981568700417,https://english.manoramaonline.com/news/kerala/2020/03/31/second-coronavirus-death-kerala.html,https://www.thehindu.com/news/national/kerala/covid-19-kerala-records-second-death/article31214404.ece,P1449
181,31/03/2020,47,F,Deceased,Salkia,Howrah,West Bengal,WB,"Recently visited Dooars in North Bengal, no other travel known.",,https://twitter.com/PTI_News/status/1244833261802541057,https://www.deccanherald.com/national/east-and-northeast/covid-19-death-toll-rises-to-4-in-bengal-total-cases-32-819857.html,https://www.telegraphindia.com/states/west-bengal/2-more-coronavirus-deaths-in-bengal/cid/1760980,P1385
182,31/03/2020,,M,Deceased,,,Jammu and Kashmir,JK,Details awaited,,https://www.business-standard.com/article/current-affairs/nizamuddin-coronavirus-shocker-govt-stares-at-another-crisis-as-seven-die-120033100203_1.html,,,