Patient Number,State Patient Number,Date Announced,Estimated Onset Date,Age Bracket,Gender,Detected City,Detected District,Detected State,State code,Current Status,Notes,Contracted from which Patient (Suspected),Nationality,Type of transmission,Status Change Date,Source_1,Source_2,Source_3,Backup Notes,Num Cases
1,KL-TS-P1,30/01/2020,,20,F,Thrissur,Thrissur,Kerala,KL,Recovered,Travelled from Wuhan,,India,Imported,14/02/2020,https://twitter.com/vijayanpinarayi/status/1222819465143832577,https://weather.com/en-IN/india/news/news/2020-02-14-kerala-defeats-coronavirus-indias-three-covid-19-patients-successfully,,Student from Wuhan,1
2,KL-AL-P1,02/02/2020,,,,Alappuzha,Alappuzha,Kerala,KL,Recovered,Travelled from Wuhan,,India,Imported,14/02/2020,https://www.indiatoday.in/india/story/kerala-reports-second-case-of-coronavirus-1642494-2020-02-02,https://weather.com/en-IN/india/news/news/2020-02-14-kerala-defeats-coronavirus-indias-three-covid-19-patients-successfully,,Student from Wuhan,1
3,KL-KS-P1,03/02/2020,,,,Kasaragod,Kasaragod,Kerala,KL,Recovered,Travelled from Wuhan,,India,Imported,14/02/2020,https://www.indiatoday.in/india/story/kerala-now-confirms-third-case-of-coronavirus-1642789-2020-02-03,https://twitter.com/ANI/status/1224221485805395968?s=20,https://weather.com/en-IN/india/news/news/2020-02-14-kerala-defeats-coronavirus-indias-three-covid-19-patients-successfully,Student from Wuhan,1
4,DL-P1,02/03/2020,,45,M,East Delhi (Mayur Vihar),East Delhi,Delhi,DL,Recovered,"Travelled from Austria, Italy",,India,Imported,15/03/2020,https://www.indiatoday.in/india/story/not-a-jail-delhi-s-1st-covid-19-patient-recalls-time-in-isolation-ward-has-this-one-tip-for-others-1656088-2020-03-16,https://economictimes.indiatimes.com/news/politics-and-nation/coronavirus-cases-in-india-live-news-latest-updates-mar2/liveblog/74432375.cms,,Travel history to Italy and Austria,1
5,TS-P1,02/03/2020,,24,M,Hyderabad,Hyderabad,Telangana,TG,Recovered,"Travelled from Dubai to Bangalore on 20th Feb, stayed there for 2 days and took a bus to Hyderabad",,India,Imported,02/03/2020,https://www.deccanherald.com/national/south/quarantine-not-a-jail-no-stigma-attached-telanganas-first-coronavirus-case-and-survivor-819012.html,https://www.indiatoday.in/india/story/coronavirus-in-india-tracking-country-s-first-50-covid-19-cases-what-numbers-tell-1654468-2020-03-12,https://www.thehindu.com/news/national/coronavirus-live-updates-march-14-2020/article31066969.ece,"Travel history to Dubai, Singapore contact",1
6,,03/03/2020,,69,M,Jaipur,Italians,Rajasthan,RJ,Recovered,Travelled from Italy,,Italy,Imported,03/03/2020,https://indianexpress.com/article/india/coronavirus-outbreak-live-updates-pm-modi-6303338/,https://economictimes.indiatimes.com/news/politics-and-nation/all-3-old-corona-positive-patients-cured-one-new-virus-hit-man-undergoing-treatment-official/articleshow/74638120.cms?from=mdr,https://twitter.com/PTI_News/status/1240878975846506496,Italian tourist,1
7,,04/03/2020,,55,,Gurugram,Italians,Haryana,HR,Recovered,Travelled from Italy,P6,Italy,Imported,29/03/2020,https://indianexpress.com/article/india/coronavirus-outbreak-live-updates-pm-modi-6303338/,https://www.indiatoday.in/india/story/coronavirus-in-india-tracking-country-s-first-50-covid-19-cases-what-numbers-tell-1654468-2020-03-12,,Italian tourist,1
8,,04/03/2020,,55,,Gurugram,Italians,Haryana,HR,Recovered,Travelled from Italy,P6,Italy,Imported,29/03/2020,https://indianexpress.com/article/india/coronavirus-outbreak-live-updates-pm-modi-6303338/,https://www.indiatoday.in/india/story/coronavirus-in-india-tracking-country-s-first-50-covid-19-cases-what-numbers-tell-1654468-2020-03-12,,Italian tourist,1
9,,04/03/2020,,55,,Gurugram,Italians,Haryana,HR,Recovered,Travelled from Italy,P6,Italy,Imported,29/03/2020,https://indianexpress.com/article/india/coronavirus-outbreak-live-updates-pm-modi-6303338/,https://www.indiatoday.in/india/story/coronavirus-in-india-tracking-country-s-first-50-covid-19-cases-what-numbers-tell-1654468-2020-03-12,,Italian tourist,1
10,,04/03/2020,,55,,Gurugram,Italians,Haryana,HR,Recovered,Travelled from Italy,P6,Italy,Imported,29/03/2020,https://indianexpress.com/article/india/coronavirus-outbreak-live-updates-pm-modi-6303338/,https://www.indiatoday.in/india/story/coronavirus-in-india-tracking-country-s-first-50-covid-19-cases-what-numbers-tell-1654468-2020-03-12,,Italian tourist,1
11,,04/03/2020,,55,,Gurugram,Italians,Haryana,HR,Recovered,Travelled from Italy,P6,Italy,Imported,29/03/2020,https://indianexpress.com/article/india/coronavirus-outbreak-live-updates-pm-modi-6303338/,https://www.indiatoday.in/india/story/coronavirus-in-india-tracking-country-s-first-50-covid-19-cases-what-numbers-tell-1654468-2020-03-12,,Italian tourist,1
12,,04/03/2020,,55,,Gurugram,Italians,Haryana,HR,Recovered,Travelled from Italy,P6,Italy,Imported,29/03/2020,https://indianexpress.com/article/india/coronavirus-outbreak-live-updates-pm-modi-6303338/,https://www.indiatoday.in/india/story/coronavirus-in-india-tracking-country-s-first-50-covid-19-cases-what-numbers-tell-1654468-2020-03-12,,Italian tourist,1
13,,04/03/2020,,55,,Gurugram,Italians,Haryana,HR,Recovered,Travelled from Italy,P6,Italy,Imported,29/03/2020,https://indianexpress.com/article/india/coronavirus-outbreak-live-updates-pm-modi-6303338/,https://www.indiatoday.in/india/story/coronavirus-in-india-tracking-country-s-first-50-covid-19-cases-what-numbers-tell-1654468-2020-03-12,,Italian tourist,1
14,,04/03/2020,,55,,Gurugram,Italians,Haryana,HR,Recovered,Travelled from Italy,P6,Italy,Imported,29/03/2020,https://indianexpress.com/article/india/coronavirus-outbreak-live-updates-pm-modi-6303338/,https://www.indiatoday.in/india/story/coronavirus-in-india-tracking-country-s-first-50-covid-19-cases-what-numbers-tell-1654468-2020-03-12,,Italian tourist,1
15,,04/03/2020,,55,,Gurugram,Italians,Haryana,HR,Recovered,Travelled from Italy,P6,Italy,Imported,29/03/2020,https://indianexpress.com/article/india/coronavirus-outbreak-live-updates-pm-modi-6303338/,https://www.indiatoday.in/india/story/coronavirus-in-india-tracking-country-s-first-50-covid-19-cases-what-numbers-tell-1654468-2020-03-12,,Italian tourist,1
16,,04/03/2020,,55,,Gurugram,Italians,Haryana,HR,Recovered,Travelled from Italy,P6,Italy,Imported,29/03/2020,https://indianexpress.com/article/india/coronavirus-outbreak-live-updates-pm-modi-6303338/,https://www.indiatoday.in/india/story/coronavirus-in-india-tracking-country-s-first-50-covid-19-cases-what-numbers-tell-1654468-2020-03-12,,Italian tourist,1
17,,04/03/2020,,55,,Gurugram,Italians,Haryana,HR,Recovered,Travelled from Italy,P6,Italy,Imported,29/03/2020,https://indianexpress.com/article/india/coronavirus-outbreak-live-updates-pm-modi-6303338/,https://www.indiatoday.in/india/story/coronavirus-in-india-tracking-country-s-first-50-covid-19-cases-what-numbers-tell-1654468-2020-03-12,,Italian tourist,1
18,,04/03/2020,,55,,Gurugram,Italians,Haryana,HR,Recovered,Travelled from Italy,P6,Italy,Imported,29/03/2020,https://indianexpress.com/article/india/coronavirus-outbreak-live-updates-pm-modi-6303338/,https://www.indiatoday.in/india/story/coronavirus-in-india-tracking-country-s-first-50-covid-19-cases-what-numbers-tell-1654468-2020-03-12,,Italian tourist,1
19,,04/03/2020,,55,,Gurugram,Italians,Haryana,HR,Hospitalized,Travelled from Italy,P6,Italy,Imported,04/03/2020,https://indianexpress.com/article/india/coronavirus-outbreak-live-updates-pm-modi-6303338/,https://www.indiatoday.in/india/story/coronavirus-in-india-tracking-country-s-first-50-covid-19-cases-what-numbers-tell-1654468-2020-03-12,,Italian tourist,1
20,,04/03/2020,,55,,Gurugram,Italians,Haryana,HR,Hospitalized,Travelled from Italy,P6,Italy,Imported,04/03/2020,https://indianexpress.com/article/india/coronavirus-outbreak-live-updates-pm-modi-6303338/,https://www.indiatoday.in/india/story/coronavirus-in-india-tracking-country-s-first-50-covid-19-cases-what-numbers-tell-1654468-2020-03-12,,Italian tourist,1
21,,04/03/2020,,70,F,Jaipur,Italians,Rajasthan,RJ,Recovered,"Travelled from Italy, Wife of P6",P6,Italy,Imported,04/03/2020,https://indianexpress.com/article/india/coronavirus-outbreak-live-updates-pm-modi-6303338/,https://www.indiatoday.in/india/story/coronavirus-in-india-tracking-country-s-first-50-covid-19-cases-what-numbers-tell-1654468-2020-03-12,https://economictimes.indiatimes.com/news/politics-and-nation/all-3-old-corona-positive-patients-cured-one-new-virus-hit-man-undergoing-treatment-official/articleshow/74638120.cms?from=mdr,Italian tourist (wife of P6),1
22,,04/03/2020,,,M,Agra,Agra,Uttar Pradesh,UP,Hospitalized,Family members of P4,P4,India,Local,04/03/2020,https://www.businesstoday.in/latest/trends/coronavirus-spreads-to-agra-six-cases-detected/story/397414.html,,,Family members of P4,1
23,,04/03/2020,,,F,Agra,Agra,Uttar Pradesh,UP,Recovered,Family members of P4,P4,India,Local,15/03/2020,https://www.businesstoday.in/latest/trends/coronavirus-spreads-to-agra-six-cases-detected/story/397414.html,,,Family members of P4,1
24,,04/03/2020,,45,F,Agra,Agra,Uttar Pradesh,UP,Recovered,Family members of P4,P4,India,Local,15/03/2020,https://www.businesstoday.in/latest/trends/coronavirus-spreads-to-agra-six-cases-detected/story/397414.html,,,Family members of P4,1
25,,04/03/2020,,,M,Agra,Agra,Uttar Pradesh,UP,Recovered,Family members of P4,P4,India,Local,15/03/2020,https://www.businesstoday.in/latest/trends/coronavirus-spreads-to-agra-six-cases-detected/story/397414.html,,,Family members of P4,1
26,,04/03/2020,,16,M,Agra,Agra,Uttar Pradesh,UP,Recovered,Family members of P4,P4,India,Local,15/03/2020,https://www.businesstoday.in/latest/trends/coronavirus-spreads-to-agra-six-cases-detected/story/397414.html,,,Family members of P4,1
27,,04/03/2020,,,,Agra,Agra,Uttar Pradesh,UP,Hospitalized,Family members of P4,P4,India,Local,04/03/2020,https://www.businesstoday.in/latest/trends/coronavirus-spreads-to-agra-six-cases-detected/story/397414.html,,,Family members of P4,1
28,,04/03/2020,,,,,Agra,Uttar Pradesh,UP,Hospitalized,"Accompanied the Italian tourists, Nationality: Indian",P6,India,Local,04/03/2020,https://indianexpress.com/article/india/coronavirus-outbreak-live-updates-pm-modi-6303338/,https://www.indiatoday.in/india/story/coronavirus-in-india-tracking-country-s-first-50-covid-19-cases-what-numbers-tell-1654468-2020-03-12,,Indian who accompanied the Italian tourists,1
29,DL-P2,05/03/2020,,27,M,Janakpuri,South West Delhi,Delhi,DL,Hospitalized,"Travelled from Italy PayTm Emp, ",,India,Imported,05/03/2020,https://indianexpress.com/article/india/coronavirus-outbreak-live-updates-pm-modi-6303338/,https://www.indiatoday.in/india/story/coronavirus-in-india-tracking-country-s-first-50-covid-19-cases-what-numbers-tell-1654468-2020-03-12,,"PayTm Emp, Travelled from Italy",1
30,,05/03/2020,,59,M,Ghaziabad,Ghaziabad,Uttar Pradesh,UP,Recovered,Travelled from Iran,,India,Imported,05/03/2020,https://indianexpress.com/article/india/coronavirus-outbreak-live-updates-pm-modi-6303338/,https://www.indiatoday.in/india/story/delhi-positive-coronavirus-number-cases-rise-india-news-update-1653008-2020-03-06,https://timesofindia.indiatimes.com/city/mumbai/coronavirus-in-india-live-updates-march-18-2020/liveblog/74683100.cms,Travelled to Iran,1
31,DL-P3,06/03/2020,,,,Uttam Nagar,West Delhi,Delhi,DL,Recovered,Travelled from Thailand and Malaysia,,India,Imported,15/03/2020,https://indianexpress.com/article/india/coronavirus-outbreak-live-updates-pm-modi-6303338/,https://www.indiatoday.in/india/story/delhi-positive-coronavirus-number-cases-rise-india-news-update-1653008-2020-03-06,http://health.delhigovt.nic.in/wps/wcm/connect/d9bd65804d9102c6a3baf7982ee7a5c7/HB15.pdf?MOD=AJPERES&lmod=-506630906&CACHEID=d9bd65804d9102c6a3baf7982ee7a5c7,Travelled to Thailand and Malaysia,1
32,,07/03/2020,,65,M,Ladakh,Leh,Ladakh,LA,Hospitalized,Travelled from Iran,,India,Imported,07/03/2020,https://indianexpress.com/article/india/coronavirus-outbreak-live-updates-pm-modi-6303338/,https://www.indiatoday.in/india/story/coronavirus-in-india-tracking-country-s-first-50-covid-19-cases-what-numbers-tell-1654468-2020-03-12,,Travelled from Iran,1
33,,07/03/2020,,75,M,Ladakh,Leh,Ladakh,LA,Hospitalized,,,India,TBD,07/03/2020,https://indianexpress.com/article/india/coronavirus-outbreak-live-updates-pm-modi-6303338/,https://www.indiatoday.in/india/story/coronavirus-in-india-tracking-country-s-first-50-covid-19-cases-what-numbers-tell-1654468-2020-03-12,,Travelled from Iran,1
34,TN-P1,07/03/2020,,45,M,Kancheepuram,Kancheepuram,Tamil Nadu,TN,Recovered,Travelled from Oman to Chennai Airport on 28.02.2020,,India,Imported,07/03/2020,https://indianexpress.com/article/india/coronavirus-outbreak-live-updates-pm-modi-6303338/,https://timesofindia.indiatimes.com/city/chennai/tamil-nadus-lone-covid-19-patient-recovers-to-be-discharged-from-chennai-hospital-on-monday/articleshow/74639130.cms,https://www.indiatoday.in/india/story/coronavirus-in-india-tracking-country-s-first-50-covid-19-cases-what-numbers-tell-1654468-2020-03-12,Travelled from Oman,1
35,KL-PT-P1,08/03/2020,,24,M,Ranni,Pathanamthitta,Kerala,KL,Recovered,Travelled from Italy on 29/02/2020 through Doha,,India,Imported,27/03/2020,https://indianexpress.com/article/india/coronavirus-outbreak-live-updates-pm-modi-6303338/,https://www.google.com/url?sa=t&rct=j&q=&esrc=s&source=web&cd=1&cad=rja&uact=8&ved=2ahUKEwiq4ZOK7aHoAhWWH7cAHXyvBxgQFjAAegQIBhAB&url=https%3A%2F%2Fm.economictimes.com%2Fnews%2Fpolitics-and-nation%2Ffive-more-people-from-kerala-test-positive-for-coronavirus%2Farticleshow%2F74534888.cms&usg=AOvVaw0zADrc8fBj8SsZDqkG3Cwb,http://dhs.kerala.gov.in/wp-content/uploads/2020/03/Daily-Bulletin-English-29th-March.pdf,Travel from Italy on 29/02/2020 through Doha,1
36,KL-PT-P1,08/03/2020,,54,M,Ranni,Pathanamthitta,Kerala,KL,Recovered,Travelled from Italy on 29/02/2020 through Doha,P35,India,Imported,29/03/2020,https://www.indiatoday.in/india/story/coronavirus-outbreak-more-test-positive-kerala-state-steps-precautionary-measures-1653599-2020-03-08,https://www.google.com/url?sa=t&rct=j&q=&esrc=s&source=web&cd=1&cad=rja&uact=8&ved=2ahUKEwiq4ZOK7aHoAhWWH7cAHXyvBxgQFjAAegQIBhAB&url=https%3A%2F%2Fm.economictimes.com%2Fnews%2Fpolitics-and-nation%2Ffive-more-people-from-kerala-test-positive-for-coronavirus%2Farticleshow%2F74534888.cms&usg=AOvVaw0zADrc8fBj8SsZDqkG3Cwb,http://dhs.kerala.gov.in/wp-content/uploads/2020/03/Daily-Bulletin-English-29th-March.pdf,Travel from Italy on 29/02/2020 through Doha,1
37,KL-P1-P1,08/03/2020,,53,F,Ranni,Pathanamthitta,Kerala,KL,Recovered,Travelled from Italy on 29/02/2020 through Doha,P35,India,Imported,29/03/2020,https://www.indiatoday.in/india/story/coronavirus-outbreak-more-test-positive-kerala-state-steps-precautionary-measures-1653599-2020-03-08,https://www.google.com/url?sa=t&rct=j&q=&esrc=s&source=web&cd=1&cad=rja&uact=8&ved=2ahUKEwiq4ZOK7aHoAhWWH7cAHXyvBxgQFjAAegQIBhAB&url=https%3A%2F%2Fm.economictimes.com%2Fnews%2Fpolitics-and-nation%2Ffive-more-people-from-kerala-test-positive-for-coronavirus%2Farticleshow%2F74534888.cms&usg=AOvVaw0zADrc8fBj8SsZDqkG3Cwb,http://dhs.kerala.gov.in/wp-content/uploads/2020/03/Daily-Bulletin-English-29th-March.pdf,Travel from Italy on 29/02/2020 through Doha,1
38,KL-PT-P2,08/03/2020,,65,M,Ranni,Pathanamthitta,Kerala,KL,Recovered,Relative and neighbour of P35-P37,P35,India,Local,29/03/2020,https://www.indiatoday.in/india/story/coronavirus-outbreak-more-test-positive-kerala-state-steps-precautionary-measures-1653599-2020-03-08,https://www.google.com/url?sa=t&rct=j&q=&esrc=s&source=web&cd=1&cad=rja&uact=8&ved=2ahUKEwiq4ZOK7aHoAhWWH7cAHXyvBxgQFjAAegQIBhAB&url=https%3A%2F%2Fm.economictimes.com%2Fnews%2Fpolitics-and-nation%2Ffive-more-people-from-kerala-test-positive-for-coronavirus%2Farticleshow%2F74534888.cms&usg=AOvVaw0zADrc8fBj8SsZDqkG3Cwb,http://dhs.kerala.gov.in/wp-content/uploads/2020/03/Daily-Bulletin-English-29th-March.pdf,Relative and neighbour of P35-P37,1
39,KL-PT-P2,08/03/2020,,61,F,Ranni,Pathanamthitta,Kerala,KL,Recovered,Relative  and neighbour of P35-P37,P35,India,Local,29/03/2020,https://www.indiatoday.in/india/story/coronavirus-outbreak-more-test-positive-kerala-state-steps-precautionary-measures-1653599-2020-03-08,https://www.google.com/url?sa=t&rct=j&q=&esrc=s&source=web&cd=1&cad=rja&uact=8&ved=2ahUKEwiq4ZOK7aHoAhWWH7cAHXyvBxgQFjAAegQIBhAB&url=https%3A%2F%2Fm.economictimes.com%2Fnews%2Fpolitics-and-nation%2Ffive-more-people-from-kerala-test-positive-for-coronavirus%2Farticleshow%2F74534888.cms&usg=AOvVaw0zADrc8fBj8SsZDqkG3Cwb,http://dhs.kerala.gov.in/wp-content/uploads/2020/03/Daily-Bulletin-English-29th-March.pdf,Relative  and neighbour of P35-P37,1
40,DL-P4,09/03/2020,,25,F,Tri Nagar,North Delhi,Delhi,DL,Hospitalized,No travel history,P29,India,Local,09/03/2020,https://www.indiatoday.in/india/story/coronavirus-in-india-tracking-country-s-first-50-covid-19-cases-what-numbers-tell-1654468-2020-03-12,http://health.delhigovt.nic.in/wps/wcm/connect/665cd7804d7b94b18194f7982ee7a5c7/HB07.pdf?MOD=AJPERES&lmod=-1110807331&CACHEID=665cd7804d7b94b18194f7982ee7a5c7,https://www.hindustantimes.com/cities/two-more-delhi-residents-test-positive-for-covid-19-total-now-10/story-eZf1cfA2jqI6n7owy6xPXJ.html,No travel history,1
41,,09/03/2020,,63,F,Jammu,Jammu,Jammu and Kashmir,JK,Hospitalized,Travelled from Iran,,India,Imported,09/03/2020,https://www.indiatoday.in/india/story/coronavirus-outbreak-delhi-up-jammu-kashmir-reports-confirmed-case-each-total-india-rises-health-ministry-1653889-2020-03-09,,,"Travel history - Italy, S Korea, Iran",1
42,KA-P1,09/03/2020,,46,M,Bengaluru,Bengaluru Urban,Karnataka,KA,Recovered,"Travelled from US via London, Mindtree Employee",,India,Imported,27/03/2020,https://www.indiatoday.in/india/story/tracking-coronavirus-patients-in-karnataka-who-went-where-1655701-2020-03-15,,,"Mindtree Employee, Returned from US via London",1
43,KL-KN-1,09/03/2020,,3,M,Kannur,Kannur,Kerala,KL,Recovered,Travelled from Italy on 07/03/2020 (Parents in isolation),,India,Imported,26/03/2020,https://www.hindustantimes.com/india-news/toddler-who-tested-positive-for-coronavirus-in-kerala-stable-say-doctors/story-OoG4vtecOuo9EgROk0lgtO.html,https://www.facebook.com/kkshailaja/posts/2892388584182437,,Travel from Italy on 07/03/2020 (Parents in isolation),1
44,,09/03/2020,,,M,Pune,Pune,Maharashtra,MH,Recovered,"Travelled from Dubai on 1 March, Husband of P45",,India,Imported,25/03/2020,https://www.indiatoday.in/india/story/two-with-travel-history-to-dubai-test-positive-for-coronavirus-in-pune-1654113-2020-03-09,https://www.firstpost.com/health/coronavirus-outbreak-latest-updates-covid-19-india-alert-novel-coronavirus-holi-2020-latest-news-today-8115121.html,https://www.thehindu.com/news/national/coronavirus-live-updates-march-9-2020/article31020875.ece,"Returned from Dubai on 1 March, Husband of P45",1
45,,09/03/2020,,,F,Pune,Pune,Maharashtra,MH,Recovered,"Travelled from Dubai on 1 March, Wife of P44",,India,Imported,25/03/2020,https://www.indiatoday.in/india/story/two-with-travel-history-to-dubai-test-positive-for-coronavirus-in-pune-1654113-2020-03-09,https://www.firstpost.com/health/coronavirus-outbreak-latest-updates-covid-19-india-alert-novel-coronavirus-holi-2020-latest-news-today-8115121.html,https://www.thehindu.com/news/national/coronavirus-live-updates-march-9-2020/article31020875.ece,"Returned from Dubai on 1 March, Wife of P44",1
46,PJ-P1,09/03/2020,,,M,Amritsar,Amritsar,Punjab,PB,Hospitalized,Travelled from Italy,,Italy,Imported,09/03/2020,https://www.indiatoday.in/india/story/coronavirus-outbreak-punjab-confirms-first-positive-case-patient-had-travelled-to-italy-1654059-2020-03-09,https://punjabupdate.com/media-bulletin-21-03-2020-covid-19-punjab-total-number-of-positive-cases-rise-to-13.html,,Returned from Milan,1
47,,09/03/2020,,48,M,Agra,Agra,Uttar Pradesh,UP,Recovered,Factory Manager contact with businessman from Italy,P4,India,Local,20/03/2020,https://timesofindia.indiatimes.com/city/agra/four-more-agra-residents-cured-of-covid-19-discharged-from-delhis-safdarjung-hosp/articleshow/74718669.cms,,,Factory worker contact with businessman,1
48,,09/03/2020,,,,Agra,Agra,Uttar Pradesh,UP,Hospitalized,Was in contact with P22-P27,P22,India,Local,09/03/2020,https://www.indiatoday.in/india/story/coronavirus-outbreak-delhi-up-jammu-kashmir-reports-confirmed-case-each-total-india-rises-health-ministry-1653889-2020-03-09,,,Was in contact with P22-P27,1
49,KL-PT-P3,10/03/2020,,,,Kozhencherry,Pathanamthitta,Kerala,KL,Recovered,"Friends of P35, P36, P37","P35, P36, P37",India,Local,03/04/2020,https://www.firstpost.com/india/coronavirus-outbreak-kerala-govt-warns-against-hiding-travel-history-after-italy-returned-family-infects-eight-confirmed-cases-rise-to-14-8140451.html,https://english.manoramaonline.com/news/kerala/2020/03/10/coronavirus-holiday-for-upto-class-7-kerala.html,https://www.thehindu.com/news/national/kerala/coronavirus-five-more-people-from-kerala-test-positive-for-covid-19/article31014406.ece,"Friends of P35, P36, P37",1
50,KL-PT-P4,10/03/2020,,,,Kozhencherry,Pathanamthitta,Kerala,KL,Hospitalized,"Friends of P35, P36, P37","P35, P36, P37",India,Local,10/03/2020,https://www.firstpost.com/india/coronavirus-outbreak-kerala-govt-warns-against-hiding-travel-history-after-italy-returned-family-infects-eight-confirmed-cases-rise-to-14-8140451.html,https://english.manoramaonline.com/news/kerala/2020/03/10/coronavirus-holiday-for-upto-class-7-kerala.html,https://www.thehindu.com/news/national/kerala/coronavirus-five-more-people-from-kerala-test-positive-for-covid-19/article31014406.ece,"Friends of P35, P36, P37",1
51,KA-P2,10/03/2020,,40,M,Bengaluru,Bengaluru Urban,Karnataka,KA,Recovered,"Travelled from US on Feb 28, Dell Employee",,India,Imported,24/03/2020,https://www.indiatoday.in/india/story/coronavirus-in-india-tracking-country-s-first-50-covid-19-cases-what-numbers-tell-1654468-2020-03-12,,,"Dell Employee, Returned from Austin on Feb 28",1
52,KA-P3,10/03/2020,,47,F,Bengaluru,Bengaluru Urban,Karnataka,KA,Recovered,Wife of P51,P51,India,Local,27/03/2020,https://www.indiatoday.in/india/story/coronavirus-in-india-tracking-country-s-first-50-covid-19-cases-what-numbers-tell-1654468-2020-03-12,https://www.newindianexpress.com/states/karnataka/2020/mar/20/coronavirus-two-patients-recover-to-be-discharged-on-friday-2119125.html,,Wife of P51,1
53,KA-P4,10/03/2020,,13,F,Bengaluru,Bengaluru Urban,Karnataka,KA,Recovered,Daughter of P51 and P52,P51,India,Local,24/03/2020,https://www.indiatoday.in/india/story/coronavirus-in-india-tracking-country-s-first-50-covid-19-cases-what-numbers-tell-1654468-2020-03-12,,,Daughter of P51 and P52,1
54,KL-EL-P1,10/03/2020,,,M,Kochi,Ernakulam,Kerala,KL,Recovered,Father of P43,P43,India,Local,26/03/2020,https://www.livemint.com/news/india/coronavirus-update-two-more-people-test-positive-for-covid-19-in-kerala-11583852482247.html,https://english.manoramaonline.com/news/kerala/2020/03/10/coronavirus-holiday-for-upto-class-7-kerala.html,https://www.facebook.com/kkshailaja/posts/2892388584182437,Father of P43,1
55,KL-EL-P2,10/03/2020,,,F,Kochi,Ernakulam,Kerala,KL,Recovered,Mother of P43,P43,India,Local,26/03/2020,https://www.livemint.com/news/india/coronavirus-update-two-more-people-test-positive-for-covid-19-in-kerala-11583852482247.html,https://english.manoramaonline.com/news/kerala/2020/03/10/coronavirus-holiday-for-upto-class-7-kerala.html,https://www.facebook.com/kkshailaja/posts/2892388584182437,Mother of P43,1