Entry_ID,State Patient Number,Date Announced,Age Bracket,Gender,Detected City,Detected District,Detected State,State code,Num Cases,Current Status,Contracted from which Patient (Suspected),Notes,Source_1,Source_2,Source_3,Nationality,Type of transmission,Status Change Date,Patient Number
10009,,10/05/2020,,,,Ajmer,Rajasthan,RJ,2,Hospitalized,,,https://twitter.com/ANI/status/1259331384851775488?s=09,,,,,,37900
10010,,10/05/2020,,,,Dungarpur,Rajasthan,RJ,1,Hospitalized,,,https://twitter.com/ANI/status/1259331384851775488?s=09,,,,,,37901
10011,,10/05/2020,,,,Jaipur,Rajasthan,RJ,10,Hospitalized,,,https://twitter.com/ANI/status/1259331384851775488?s=09,,,,,,37902
10012,,10/05/2020,,,,Kota,Rajasthan,RJ,9,Hospitalized,,,https://twitter.com/ANI/status/1259331384851775488?s=09,,,,,,37903
10013,,10/05/2020,,,,Pali,Rajasthan,RJ,2,Hospitalized,,,https://twitter.com/ANI/status/1259331384851775488?s=09,,,,,,37904
10014,,10/05/2020,,,,Udaipur,Rajasthan,RJ,9,Hospitalized,,,https://twitter.com/ANI/status/1259331384851775488?s=09,,,,,,37905
10015,,10/05/2020,,,,Jaipur,Rajasthan,RJ,1,Deceased,,,https://twitter.com/ANI/status/1259331384851775488?s=09,,,,,,37906
10016,,10/05/2020,,,,Banswara,Rajasthan,RJ,4,Recovered,,,https://twitter.com/ANI/status/1259331384851775488?s=09,,,,,,37907
10017,,10/05/2020,,,,Bharatpur,Rajasthan,RJ,2,Recovered,,,https://twitter.com/ANI/status/1259331384851775488?s=09,,,,,,37908
10018,,10/05/2020,,,,Chittorgarh,Rajasthan,RJ,6,Recovered,,,https://twitter.com/ANI/status/1259331384851775488?s=09,,,,,,37909
10019,,10/05/2020,,,,Nagaur,Rajasthan,RJ,2,Recovered,,,https://twitter.com/ANI/status/1259331384851775488?s=09,,,,,,37910
10020,,10/05/2020,14,M,Saharsha Basti,Saharsa,Bihar,BR,1,Hospitalized,,,https://twitter.com/sanjayjavin/status/1259325877390733317?s=19,,,,,,37913
10021,,10/05/2020,18,M,Saharsha Basti,Saharsa,Bihar,BR,1,Hospitalized,,,https://twitter.com/sanjayjavin/status/1259325877390733317?s=19,,,,,,37914
10022,,10/05/2020,19,M,Saharsha Basti,Saharsa,Bihar,BR,1,Hospitalized,,,https://twitter.com/sanjayjavin/status/1259325877390733317?s=19,,,,,,37915
10023,,10/05/2020,13,M,Saharsha Basti,Saharsa,Bihar,BR,1,Hospitalized,,,https://twitter.com/sanjayjavin/status/1259325877390733317?s=19,,,,,,37916
10024,,10/05/2020,18,M,Saharsha Basti,Saharsa,Bihar,BR,1,Hospitalized,,,https://twitter.com/sanjayjavin/status/1259325877390733317?s=19,,,,,,37917
10025,,10/05/2020,25,M,Sahmoorha,Saharsa,Bihar,BR,1,Hospitalized,,,https://twitter.com/sanjayjavin/status/1259325877390733317?s=19,,,,,,37918
10026,,10/05/2020,20,M,Madanpur,Saharsa,Bihar,BR,1,Hospitalized,,,https://twitter.com/sanjayjavin/status/1259325877390733317?s=19,,,,,,37919
10027,,10/05/2020,18,M,Puraini,Madhepura,Bihar,BR,1,Hospitalized,,,https://twitter.com/sanjayjavin/status/1259325877390733317?s=19,,,,,,37920
10028,,10/05/2020,20,M,Puraini,Madhepura,Bihar,BR,1,Hospitalized,,,https://twitter.com/sanjayjavin/status/1259325877390733317?s=19,,,,,,37921
10029,,10/05/2020,17,M,Puraini,Madhepura,Bihar,BR,1,Hospitalized,,,https://twitter.com/sanjayjavin/status/1259325877390733317?s=19,,,,,,37922
10030,,10/05/2020,10,M,Puraini,Madhepura,Bihar,BR,1,Hospitalized,,,https://twitter.com/sanjayjavin/status/1259325877390733317?s=19,,,,,,37923
10031,,10/05/2020,13,M,Puraini,Madhepura,Bihar,BR,1,Hospitalized,,,https://twitter.com/sanjayjavin/status/1259325877390733317?s=19,,,,,,37924
10032,,10/05/2020,15,M,Puraini,Madhepura,Bihar,BR,1,Hospitalized,,,https://twitter.com/sanjayjavin/status/1259325877390733317?s=19,,,,,,37925
10033,,10/05/2020,16,M,Ghailadh,Madhepura,Bihar,BR,1,Hospitalized,,,https://twitter.com/sanjayjavin/status/1259325877390733317?s=19,,,,,,37926
10034,,10/05/2020,53,M,Mohmmadpur,Begusarai,Bihar,BR,1,Hospitalized,,,https://twitter.com/sanjayjavin/status/1259325877390733317?s=19,,,,,,37927
10035,,10/05/2020,30,M,Ranganj,Araria,Bihar,BR,1,Hospitalized,,,https://twitter.com/sanjayjavin/status/1259325877390733317?s=19,,,,,,37928
10036,,10/05/2020,30,M,Alinagar,Darbhanga,Bihar,BR,1,Hospitalized,,,https://twitter.com/sanjayjavin/status/1259325877390733317?s=19,,,,,,37929
10037,,10/05/2020,45,M,Gauraboram,Darbhanga,Bihar,BR,1,Hospitalized,,,https://twitter.com/sanjayjavin/status/1259325877390733317?s=19,,,,,,37930
10038,,10/05/2020,,,,,Delhi,DL,381,Hospitalized,,"Between 12 am, 8th May and 12 am, 9th May",https://twitter.com/ANI/status/1259359231519543296,,,,,,37931
10039,,10/05/2020,,,,,Delhi,DL,49,Recovered,,"Between 12 am, 8th May and 12 am, 9th May",https://twitter.com/ANI/status/1259359231519543296,,,,,,38964
10040,,10/05/2020,,,,,Delhi,DL,5,Deceased,,"Between 12 am, 8th May and 12 am, 9th May",https://twitter.com/ANI/status/1259359231519543296,,,,,,38965
10041,,10/05/2020,,,,Kurnool,Andhra Pradesh,AP,1,Deceased,,,https://twitter.com/ArogyaAndhra/status/1259010314512723968?s=20,,,,,,38966
10042,,10/05/2020,,,,Anantapur,Andhra Pradesh,AP,5,Hospitalized,,,https://twitter.com/ArogyaAndhra/status/1259010314512723968?s=20,,,,,,38967
10043,,10/05/2020,,,,Chittoor,Andhra Pradesh,AP,16,Hospitalized,,,https://twitter.com/ArogyaAndhra/status/1259010314512723968?s=20,,,,,,38968
10044,,10/05/2020,,,,Guntur,Andhra Pradesh,AP,6,Hospitalized,,,https://twitter.com/ArogyaAndhra/status/1259010314512723968?s=20,,,,,,38969
10045,,10/05/2020,,,,Y.S.R. Kadapa,Andhra Pradesh,AP,1,Hospitalized,,,https://twitter.com/ArogyaAndhra/status/1259010314512723968?s=20,,,,,,38970
10046,,10/05/2020,,,,Krishna,Andhra Pradesh,AP,1,Hospitalized,,,https://twitter.com/ArogyaAndhra/status/1259010314512723968?s=20,,,,,,38971
10047,,10/05/2020,,,,Kurnool,Andhra Pradesh,AP,13,Hospitalized,,,https://twitter.com/ArogyaAndhra/status/1259010314512723968?s=20,,,,,,38972
10048,,10/05/2020,,,,S.P.S. Nellore,Andhra Pradesh,AP,5,Hospitalized,,,https://twitter.com/ArogyaAndhra/status/1259010314512723968?s=20,,,,,,38973
10049,,10/05/2020,,,,Prakasam,Andhra Pradesh,AP,2,Hospitalized,,,https://twitter.com/ArogyaAndhra/status/1259010314512723968?s=20,,,,,,38974
10050,,10/05/2020,,,,Visakhapatnam,Andhra Pradesh,AP,1,Hospitalized,,,https://twitter.com/ArogyaAndhra/status/1259010314512723968?s=20,,,,,,38975
10051,,10/05/2020,,,,Anantapur,Andhra Pradesh,AP,1,Recovered,,,https://twitter.com/ArogyaAndhra/status/1259010314512723968?s=20,,,,,,38976
10052,,10/05/2020,,,,East Godavari,Andhra Pradesh,AP,2,Recovered,,,https://twitter.com/ArogyaAndhra/status/1259010314512723968?s=20,,,,,,38977
10053,,10/05/2020,,,,Guntur,Andhra Pradesh,AP,8,Recovered,,,https://twitter.com/ArogyaAndhra/status/1259010314512723968?s=20,,,,,,38978
10054,,10/05/2020,,,,Krishna,Andhra Pradesh,AP,3,Recovered,,,https://twitter.com/ArogyaAndhra/status/1259010314512723968?s=20,,,,,,38979
10055,,10/05/2020,,,,S.P.S. Nellore,Andhra Pradesh,AP,1,Recovered,,,https://twitter.com/ArogyaAndhra/status/1259010314512723968?s=20,,,,,,38980
10056,,10/05/2020,,,,Visakhapatnam,Andhra Pradesh,AP,2,Recovered,,,https://twitter.com/ArogyaAndhra/status/1259010314512723968?s=20,,,,,,38981
10057,,10/05/2020,,,,Kurnool,Andhra Pradesh,AP,21,Recovered,,,https://twitter.com/ArogyaAndhra/status/1259010314512723968?s=20,,,,,,38982
10058,KA-P795,10/05/2020,29,M,,Bengaluru Urban,Karnataka,KA,1,Hospitalized,KA-C0,Contact of BBMP Containment Zone Ward No. 135,https://twitter.com/DHFWKA/status/1259378209558155265,,,,,,38983
10059,KA-P796,10/05/2020,60,M,,Other State,Karnataka,KA,1,Hospitalized,,Influenza Like Illness (ILI),https://twitter.com/DHFWKA/status/1259378209558155265,,,,,,38984
10060,KA-P797,10/05/2020,50,F,Bhatkal,Uttara Kannada,Karnataka,KA,1,Hospitalized,,Secondary Contact of P-659,https://twitter.com/DHFWKA/status/1259378209558155265,,,,,,38985
10061,KA-P798,10/05/2020,15,M,Bhatkal,Uttara Kannada,Karnataka,KA,1,Hospitalized,,Secondary Contact of P-659,https://twitter.com/DHFWKA/status/1259378209558155265,,,,,,38986
10062,KA-P799,10/05/2020,16,M,Bhatkal,Uttara Kannada,Karnataka,KA,1,Hospitalized,,Contact of P-659,https://twitter.com/DHFWKA/status/1259378209558155265,,,,,,38987
10063,KA-P800,10/05/2020,42,M,Bhatkal,Uttara Kannada,Karnataka,KA,1,Hospitalized,,Contact of P-659,https://twitter.com/DHFWKA/status/1259378209558155265,,,,,,38988
10064,KA-P801,10/05/2020,21,F,Bhatkal,Uttara Kannada,Karnataka,KA,1,Hospitalized,,Contact of P-659,https://twitter.com/DHFWKA/status/1259378209558155265,,,,,,38989
10065,KA-P802,10/05/2020,31,M,Bhatkal,Uttara Kannada,Karnataka,KA,1,Hospitalized,,Secondary Contact of P-659,https://twitter.com/DHFWKA/status/1259378209558155265,,,,,,38990
10066,KA-P803,10/05/2020,60,M,Bhatkal,Uttara Kannada,Karnataka,KA,1,Hospitalized,,Secondary Contact of P-659,https://twitter.com/DHFWKA/status/1259378209558155265,,,,,,38991
10067,KA-P804,10/05/2020,22,M,Chintamani,Chikkaballapura,Karnataka,KA,1,Hospitalized,,Contact of P-790,https://twitter.com/DHFWKA/status/1259378209558155265,,,,,,38992
10068,KA-P805,10/05/2020,35,M,Afzalpura,Kalaburagi,Karnataka,KA,1,Hospitalized,,SARI,https://twitter.com/DHFWKA/status/1259378209558155265,,,,,,38993
10069,KA-P806,10/05/2020,30,M,Kamalapura,Kalaburagi,Karnataka,KA,1,Hospitalized,,Travelled from Maharashtra.,https://twitter.com/DHFWKA/status/1259378209558155265,,,,,,38994
10070,KA-P807,10/05/2020,72,M,,Kalaburagi,Karnataka,KA,1,Hospitalized,,Contact of P-604,https://twitter.com/DHFWKA/status/1259378209558155265,,,,,,38995
10071,KA-P808,10/05/2020,65,M,Shikaripura,Shivamogga,Karnataka,KA,1,Hospitalized,,"Travelled from Ahmedabad, Gujarat",https://twitter.com/DHFWKA/status/1259378209558155265,,,,,,38996
10072,KA-P809,10/05/2020,65,M,Shikaripura,Shivamogga,Karnataka,KA,1,Hospitalized,,"Travelled from Ahmedabad, Gujarat",https://twitter.com/DHFWKA/status/1259378209558155265,,,,,,38997
10073,KA-P810,10/05/2020,18,M,Shikaripura,Shivamogga,Karnataka,KA,1,Hospitalized,,"Travelled from Ahmedabad, Gujarat",https://twitter.com/DHFWKA/status/1259378209558155265,,,,,,38998
10074,KA-P811,10/05/2020,56,M,Shikaripura,Shivamogga,Karnataka,KA,1,Hospitalized,,"Travelled from Ahmedabad, Gujarat",https://twitter.com/DHFWKA/status/1259378209558155265,,,,,,38999
10075,KA-P812,10/05/2020,43,M,Shikaripura,Shivamogga,Karnataka,KA,1,Hospitalized,,"Travelled from Ahmedabad, Gujarat",https://twitter.com/DHFWKA/status/1259378209558155265,,,,,,39000
10076,KA-P813,10/05/2020,25,M,Shikaripura,Shivamogga,Karnataka,KA,1,Hospitalized,,"Travelled from Ahmedabad, Gujarat",https://twitter.com/DHFWKA/status/1259378209558155265,,,,,,39001
10077,KA-P814,10/05/2020,27,M,Shikaripura,Shivamogga,Karnataka,KA,1,Hospitalized,,"Travelled from Ahmedabad, Gujarat",https://twitter.com/DHFWKA/status/1259378209558155265,,,,,,39002
10078,KA-P815,10/05/2020,20,M,Shikaripura,Shivamogga,Karnataka,KA,1,Hospitalized,,"Travelled from Ahmedabad, Gujarat",https://twitter.com/DHFWKA/status/1259378209558155265,,,,,,39003
10079,KA-P816,10/05/2020,33,M,Bagalkote,Belagavi,Karnataka,KA,1,Hospitalized,,"Travelled from Ajmer, Rajasthan",https://twitter.com/DHFWKA/status/1259378209558155265,,,,,,39004
10080,KA-P817,10/05/2020,50,F,,Belagavi,Karnataka,KA,1,Hospitalized,,"Travelled from Ajmer, Rajasthan",https://twitter.com/DHFWKA/status/1259378209558155265,,,,,,39005
10081,KA-P818,10/05/2020,29,F,Bagalkote,Belagavi,Karnataka,KA,1,Hospitalized,,"Travelled from Ajmer, Rajasthan",https://twitter.com/DHFWKA/status/1259378209558155265,,,,,,39006
10082,KA-P819,10/05/2020,2,F,Bagalkote,Belagavi,Karnataka,KA,1,Hospitalized,,"Travelled from Ajmer, Rajasthan",https://twitter.com/DHFWKA/status/1259378209558155265,,,,,,39007
10083,KA-P820,10/05/2020,38,M,,Belagavi,Karnataka,KA,1,Hospitalized,,"Travelled from Ajmer, Rajasthan",https://twitter.com/DHFWKA/status/1259378209558155265,,,,,,39008
10084,KA-P821,10/05/2020,17,F,,Belagavi,Karnataka,KA,1,Hospitalized,,"Travelled from Ajmer, Rajasthan",https://twitter.com/DHFWKA/status/1259378209558155265,,,,,,39009
10085,KA-P822,10/05/2020,60,F,,Belagavi,Karnataka,KA,1,Hospitalized,,"Travelled from Ajmer, Rajasthan",https://twitter.com/DHFWKA/status/1259378209558155265,,,,,,39010
10086,KA-P823,10/05/2020,10,M,,Belagavi,Karnataka,KA,1,Hospitalized,,"Travelled from Ajmer, Rajasthan",https://twitter.com/DHFWKA/status/1259378209558155265,,,,,,39011
10087,KA-P824,10/05/2020,14,F,,Belagavi,Karnataka,KA,1,Hospitalized,,"Travelled from Ajmer, Rajasthan",https://twitter.com/DHFWKA/status/1259378209558155265,,,,,,39012
10088,KA-P825,10/05/2020,40,F,,Belagavi,Karnataka,KA,1,Hospitalized,,"Travelled from Ajmer, Rajasthan",https://twitter.com/DHFWKA/status/1259378209558155265,,,,,,39013
10089,KA-P826,10/05/2020,63,M,,Belagavi,Karnataka,KA,1,Hospitalized,,"Travelled from Ajmer, Rajasthan",https://twitter.com/DHFWKA/status/1259378209558155265,,,,,,39014
10090,KA-P827,10/05/2020,20,M,,Belagavi,Karnataka,KA,1,Hospitalized,,"Travelled from Ajmer, Rajasthan",https://twitter.com/DHFWKA/status/1259378209558155265,,,,,,39015
10091,KA-P828,10/05/2020,56,F,,Belagavi,Karnataka,KA,1,Hospitalized,,"Travelled from Ajmer, Rajasthan",https://twitter.com/DHFWKA/status/1259378209558155265,,,,,,39016
10092,KA-P829,10/05/2020,29,M,,Belagavi,Karnataka,KA,1,Hospitalized,,"Travelled from Ajmer, Rajasthan",https://twitter.com/DHFWKA/status/1259378209558155265,,,,,,39017
10093,KA-P830,10/05/2020,60,F,,Belagavi,Karnataka,KA,1,Hospitalized,,"Travelled from Ajmer, Rajasthan",https://twitter.com/DHFWKA/status/1259378209558155265,,,,,,39018
10094,KA-P831,10/05/2020,25,F,,Belagavi,Karnataka,KA,1,Hospitalized,,"Travelled from Ajmer, Rajasthan",https://twitter.com/DHFWKA/status/1259378209558155265,,,,,,39019
10095,KA-P832,10/05/2020,3,F,,Belagavi,Karnataka,KA,1,Hospitalized,,"Travelled from Ajmer, Rajasthan",https://twitter.com/DHFWKA/status/1259378209558155265,,,,,,39020
10096,KA-P833,10/05/2020,46,F,,Belagavi,Karnataka,KA,1,Hospitalized,,"Travelled from Ajmer, Rajasthan",https://twitter.com/DHFWKA/status/1259378209558155265,,,,,,39021
10097,KA-P834,10/05/2020,50,F,,Belagavi,Karnataka,KA,1,Hospitalized,,"Travelled from Ajmer, Rajasthan",https://twitter.com/DHFWKA/status/1259378209558155265,,,,,,39022
10098,KA-P835,10/05/2020,30,F,Bagalkote,Belagavi,Karnataka,KA,1,Hospitalized,,"Travelled from Ajmer, Rajasthan",https://twitter.com/DHFWKA/status/1259378209558155265,,,,,,39023
10099,KA-P836,10/05/2020,8,F,Bagalkote,Belagavi,Karnataka,KA,1,Hospitalized,,"Travelled from Ajmer, Rajasthan",https://twitter.com/DHFWKA/status/1259378209558155265,,,,,,39024
10100,KA-P837,10/05/2020,12,F,Bagalkote,Belagavi,Karnataka,KA,1,Hospitalized,,"Travelled from Ajmer, Rajasthan",https://twitter.com/DHFWKA/status/1259378209558155265,,,,,,39025
10101,KA-P838,10/05/2020,22,M,Bagalkote,Belagavi,Karnataka,KA,1,Hospitalized,,"Travelled from Ajmer, Rajasthan",https://twitter.com/DHFWKA/status/1259378209558155265,,,,,,39026
10102,KA-P839,10/05/2020,75,F,Bagalkote,Belagavi,Karnataka,KA,1,Hospitalized,,"Travelled from Ajmer, Rajasthan",https://twitter.com/DHFWKA/status/1259378209558155265,,,,,,39027
10103,KA-P840,10/05/2020,12,M,,Belagavi,Karnataka,KA,1,Hospitalized,,"Travelled from Ajmer, Rajasthan",https://twitter.com/DHFWKA/status/1259378209558155265,,,,,,39028
10104,KA-P841,10/05/2020,14,M,,Belagavi,Karnataka,KA,1,Hospitalized,,"Travelled from Ajmer, Rajasthan",https://twitter.com/DHFWKA/status/1259378209558155265,,,,,,39029
10105,KA-P842,10/05/2020,27,F,,Belagavi,Karnataka,KA,1,Hospitalized,,"Travelled from Ajmer, Rajasthan",https://twitter.com/DHFWKA/status/1259378209558155265,,,,,,39030
10106,KA-P843,10/05/2020,8,F,,Belagavi,Karnataka,KA,1,Hospitalized,,"Travelled from Ajmer, Rajasthan",https://twitter.com/DHFWKA/status/1259378209558155265,,,,,,39031
10107,KA-P844,10/05/2020,3,M,,Belagavi,Karnataka,KA,1,Hospitalized,,"Travelled from Ajmer, Rajasthan",https://twitter.com/DHFWKA/status/1259378209558155265,,,,,,39032
10108,KA-P845,10/05/2020,6,M,,Belagavi,Karnataka,KA,1,Hospitalized,,"Travelled from Ajmer, Rajasthan",https://twitter.com/DHFWKA/status/1259378209558155265,,,,,,39033
10109,KA-P846,10/05/2020,56,F,,Bengaluru Urban,Karnataka,KA,1,Hospitalized,,SARI,https://twitter.com/DHFWKA/status/1259378209558155265,,,,,,39034
10110,KA-P847,10/05/2020,22,M,,Davanagere,Karnataka,KA,1,Hospitalized,,"Travelled from Ajmer, Rajasthan",https://twitter.com/DHFWKA/status/1259378209558155265,,,,,,39035
10111,KA-P502,10/05/2020,,,,Kalaburagi,Karnataka,KA,1,Recovered,,,https://twitter.com/DHFWKA/status/1259378209558155265,https://twitter.com/DHFWKA/status/1259453703796342786,,,,,39036
10112,KA-P503,10/05/2020,,,,Kalaburagi,Karnataka,KA,1,Recovered,,,https://twitter.com/DHFWKA/status/1259378209558155265,https://twitter.com/DHFWKA/status/1259453703796342786,,,,,39037
10113,KA-P516,10/05/2020,,,,Kalaburagi,Karnataka,KA,1,Recovered,,,https://twitter.com/DHFWKA/status/1259378209558155265,https://twitter.com/DHFWKA/status/1259453703796342786,,,,,39038
10114,KA-P517,10/05/2020,,,,Kalaburagi,Karnataka,KA,1,Recovered,,,https://twitter.com/DHFWKA/status/1259378209558155265,https://twitter.com/DHFWKA/status/1259453703796342786,,,,,39039
10115,KA-P518,10/05/2020,,,,Kalaburagi,Karnataka,KA,1,Recovered,,,https://twitter.com/DHFWKA/status/1259378209558155265,https://twitter.com/DHFWKA/status/1259453703796342786,,,,,39040
10116,KA-P519,10/05/2020,,,,Kalaburagi,Karnataka,KA,1,Recovered,,,https://twitter.com/DHFWKA/status/1259378209558155265,https://twitter.com/DHFWKA/status/1259453703796342786,,,,,39041
10117,KA-P520,10/05/2020,,,,Kalaburagi,Karnataka,KA,1,Recovered,,,https://twitter.com/DHFWKA/status/1259378209558155265,https://twitter.com/DHFWKA/status/1259453703796342786,,,,,39042
10118,KA-P526,10/05/2020,,,,Kalaburagi,Karnataka,KA,1,Recovered,,,https://twitter.com/DHFWKA/status/1259378209558155265,https://twitter.com/DHFWKA/status/1259453703796342786,,,,,39043
10119,KA-P527,10/05/2020,,,,Kalaburagi,Karnataka,KA,1,Recovered,,,https://twitter.com/DHFWKA/status/1259378209558155265,https://twitter.com/DHFWKA/status/1259453703796342786,,,,,39044
10120,KA-P528,10/05/2020,,,,Kalaburagi,Karnataka,KA,1,Recovered,,,https://twitter.com/DHFWKA/status/1259378209558155265,https://twitter.com/DHFWKA/status/1259453703796342786,,,,,39045
10121,KA-P530,10/05/2020,,,,Kalaburagi,Karnataka,KA,1,Recovered,,,https://twitter.com/DHFWKA/status/1259378209558155265,https://twitter.com/DHFWKA/status/1259453703796342786,,,,,39046
10122,KA-P531,10/05/2020,,,,Kalaburagi,Karnataka,KA,1,Recovered,,,https://twitter.com/DHFWKA/status/1259378209558155265,https://twitter.com/DHFWKA/status/1259453703796342786,,,,,39047
10123,KA-P532,10/05/2020,,,,Kalaburagi,Karnataka,KA,1,Recovered,,,https://twitter.com/DHFWKA/status/1259378209558155265,https://twitter.com/DHFWKA/status/1259453703796342786,,,,,39048
10124,KA-P397,10/05/2020,,,,Vijayapura,Karnataka,KA,1,Recovered,,,https://twitter.com/DHFWKA/status/1259378209558155265,https://twitter.com/DHFWKA/status/1259453703796342786,,,,,39049
10125,KA-P399,10/05/2020,,,,Vijayapura,Karnataka,KA,1,Recovered,,,https://twitter.com/DHFWKA/status/1259378209558155265,https://twitter.com/DHFWKA/status/1259453703796342786,,,,,39050
10126,KA-P402,10/05/2020,,,,Vijayapura,Karnataka,KA,1,Recovered,,,https://twitter.com/DHFWKA/status/1259378209558155265,https://twitter.com/DHFWKA/status/1259453703796342786,,,,,39051
10127,KA-P407,10/05/2020,,,,Vijayapura,Karnataka,KA,1,Recovered,,,https://twitter.com/DHFWKA/status/1259378209558155265,https://twitter.com/DHFWKA/status/1259453703796342786,,,,,39052
10128,KA-P410,10/05/2020,,,,Vijayapura,Karnataka,KA,1,Recovered,,,https://twitter.com/DHFWKA/status/1259378209558155265,https://twitter.com/DHFWKA/status/1259453703796342786,,,,,39053
10129,KA-P457,10/05/2020,,,,Vijayapura,Karnataka,KA,1,Recovered,,,https://twitter.com/DHFWKA/status/1259378209558155265,https://twitter.com/DHFWKA/status/1259453703796342786,,,,,39054
10130,KA-P846,10/05/2020,56,F,,Bengaluru Urban,Karnataka,KA,1,Deceased,,"admitted to pvt hospital on 04.05.2020, subsequently got admitted to another pvt hospital on 06.05.2020 with complaint of SARI and sample sent for COVID on same day. Patient died on 07.05.2020 and report confirmed for COVID positive on 09.05.2020.",https://twitter.com/DHFWKA/status/1259378209558155265,,,,,,39055
10131,,10/05/2020,,,,Faridabad,Haryana,HR,7,Hospitalized,,,http://www.nhmharyana.gov.in/WriteReadData/userfiles/file/CoronaVirus/Morning%20Bulletin%2010-05-2020.pdf,,,,,,39056
10132,,10/05/2020,,,,Sonipat,Haryana,HR,11,Hospitalized,,,http://www.nhmharyana.gov.in/WriteReadData/userfiles/file/CoronaVirus/Morning%20Bulletin%2010-05-2020.pdf,,,,,,39057
10133,,10/05/2020,,,,Palwal,Haryana,HR,1,Hospitalized,,,http://www.nhmharyana.gov.in/WriteReadData/userfiles/file/CoronaVirus/Morning%20Bulletin%2010-05-2020.pdf,,,,,,39058
10134,,10/05/2020,,,,Charkhi Dadri,Haryana,HR,1,Hospitalized,,,http://www.nhmharyana.gov.in/WriteReadData/userfiles/file/CoronaVirus/Morning%20Bulletin%2010-05-2020.pdf,,,,,,39059
10135,,10/05/2020,,,,Panchkula,Haryana,HR,1,Recovered,,,http://www.nhmharyana.gov.in/WriteReadData/userfiles/file/CoronaVirus/Morning%20Bulletin%2010-05-2020.pdf,,,,,,39060
10136,,10/05/2020,,M,,Durg,Chhattisgarh,CT,6,Recovered,,,https://twitter.com/bhupeshbaghel/status/1259405386441912320?s=19,,,,,,39061
10137,,10/05/2020,5,M,Sector 26,Chandigarh,Chandigarh,CH,1,Hospitalized,,Bapudham Colony,http://chdcovid19.in/,,,,,,39062
10138,,10/05/2020,45,M,Sector 26,Chandigarh,Chandigarh,CH,1,Hospitalized,,Bapudham Colony,http://chdcovid19.in/,,,,,,39063
10139,,10/05/2020,11,M,Sector 26,Chandigarh,Chandigarh,CH,1,Hospitalized,,Bapudham Colony,http://chdcovid19.in/,,,,,,39064
10140,,10/05/2020,62,M,Sector 26,Chandigarh,Chandigarh,CH,1,Hospitalized,,Bapudham Colony,http://chdcovid19.in/,,,,,,39065
10141,,10/05/2020,60,M,,Patna,Bihar,BR,1,Hospitalized,,,https://twitter.com/sanjayjavin/status/1259404488479322112,,,,,,39066
10142,,10/05/2020,31,M,,Patna,Bihar,BR,1,Hospitalized,,,https://twitter.com/sanjayjavin/status/1259404488479322112,,,,,,39067
10143,,10/05/2020,56,F,,Patna,Bihar,BR,1,Hospitalized,,,https://twitter.com/sanjayjavin/status/1259404488479322112,,,,,,39068
10144,,10/05/2020,57,M,,Gaya,Bihar,BR,1,Hospitalized,,,https://twitter.com/sanjayjavin/status/1259404488479322112,,,,,,39069
10145,,10/05/2020,26,M,,Gaya,Bihar,BR,1,Hospitalized,,,https://twitter.com/sanjayjavin/status/1259404488479322112,,,,,,39070
10146,,10/05/2020,19,M,,Arwal,Bihar,BR,1,Hospitalized,,,https://twitter.com/sanjayjavin/status/1259404488479322112,,,,,,39071
10147,,10/05/2020,28,M,,Arwal,Bihar,BR,1,Hospitalized,,,https://twitter.com/sanjayjavin/status/1259404488479322112,,,,,,39072
10148,,10/05/2020,28,M,,Arwal,Bihar,BR,1,Hospitalized,,,https://twitter.com/sanjayjavin/status/1259404488479322112,,,,,,39073
10149,,10/05/2020,30,M,,Araria,Bihar,BR,1,Hospitalized,,,https://twitter.com/sanjayjavin/status/1259404488479322112,,,,,,39074
10150,,10/05/2020,18,M,,Kishanganj,Bihar,BR,1,Hospitalized,,,https://twitter.com/sanjayjavin/status/1259404488479322112,,,,,,39075
10151,,10/05/2020,25,M,,Kishanganj,Bihar,BR,1,Hospitalized,,,https://twitter.com/sanjayjavin/status/1259404488479322112,,,,,,39076
10152,,10/05/2020,47,M,,Kishanganj,Bihar,BR,1,Hospitalized,,,https://twitter.com/sanjayjavin/status/1259404488479322112,,,,,,39077
10153,,10/05/2020,22,M,,Kishanganj,Bihar,BR,1,Hospitalized,,,https://twitter.com/sanjayjavin/status/1259404488479322112,,,,,,39078
10154,,10/05/2020,19,M,,Kishanganj,Bihar,BR,1,Hospitalized,,,https://twitter.com/sanjayjavin/status/1259404488479322112,,,,,,39079
10155,,10/05/2020,25,M,,Kishanganj,Bihar,BR,1,Hospitalized,,,https://twitter.com/sanjayjavin/status/1259404488479322112,,,,,,39080
10156,,10/05/2020,26,M,,Kishanganj,Bihar,BR,1,Hospitalized,,,https://twitter.com/sanjayjavin/status/1259404488479322112,,,,,,39081
10157,,10/05/2020,25,M,,Kishanganj,Bihar,BR,1,Hospitalized,,,https://twitter.com/sanjayjavin/status/1259404488479322112,,,,,,39082