Entry_ID,State Patient Number,Date Announced,Age Bracket,Gender,Detected City,Detected District,Detected State,State code,Num Cases,Current Status,Contracted from which Patient (Suspected),Notes,Source_1,Source_2,Source_3,Nationality,Type of transmission,Status Change Date,Patient Number
28356,,23/05/2020,,,,,Manipur,MN,0,Hospitalized,,Two cases added based on the total mentioned in the tweet. MOHFW also reported +2 than us in 24th morning update,https://twitter.com/ANI/status/1264451912960634880,,,,,,57292
28223,,24/05/2020,,,,Unassigned,State Unassigned,UN,439,Hospitalized,,,mohfw.gov.in,,,,,,57159
28224,,24/05/2020,,,,Ganjam,Odisha,OR,7,Hospitalized,,All in quarantine centres.1 Surat returnee and 6 local cases,https://health.odisha.gov.in/covid19-dashboard.html,,,,,,57160
28225,,24/05/2020,,,,Puri,Odisha,OR,16,Hospitalized,,"15 in quarantine centres. 11 Surat, 1 TN & 3 WB returnees. 1 local case in home quarantine",https://health.odisha.gov.in/covid19-dashboard.html,,,,,,57161
28226,,24/05/2020,,,,Khordha,Odisha,OR,3,Hospitalized,,All in quarantine centres. Telengana returnees,https://health.odisha.gov.in/covid19-dashboard.html,,,,,,57162
28227,,24/05/2020,,,,Cuttack,Odisha,OR,2,Hospitalized,,All in quarantine centre. Gujarat returnees,https://health.odisha.gov.in/covid19-dashboard.html,,,,,,57163
28228,,24/05/2020,,,,Nayagarh,Odisha,OR,13,Hospitalized,,All in quarantine centres. 9 Surat & 4 AP returnees,https://health.odisha.gov.in/covid19-dashboard.html,,,,,,57164
28229,,24/05/2020,,,,Sundargarh,Odisha,OR,4,Hospitalized,,"All in quarantine centres. 2 Maharastra, 1 TN & 1 WB returnees",https://health.odisha.gov.in/covid19-dashboard.html,,,,,,57165
28230,,24/05/2020,,,,Jagatsinghpur,Odisha,OR,1,Hospitalized,,In quarantine centre. Gujarat returnee,https://health.odisha.gov.in/covid19-dashboard.html,,,,,,57166
28231,,24/05/2020,,,,Angul,Odisha,OR,6,Hospitalized,,"All in quarantine centres. 1 TN, 2 Maharastra & 2 Surat returnees & 1 Bus helper of Maharastra Bus",https://health.odisha.gov.in/covid19-dashboard.html,,,,,,57167
28232,,24/05/2020,,,,Kalahandi,Odisha,OR,4,Hospitalized,,All in quarantine centres. 2 WB returnees & 2 Local cases,https://health.odisha.gov.in/covid19-dashboard.html,,,,,,57168
28233,,24/05/2020,,,,Balangir,Odisha,OR,7,Hospitalized,,"6 in quarantine centres. 1 Surat, 3  M'rashtra, 1 AP & 1 CG. 1 Delhi returnee, in home quarantine",https://health.odisha.gov.in/covid19-dashboard.html,,,,,,57169
28234,,24/05/2020,,,,Malkangiri,Odisha,OR,2,Hospitalized,,All in quarantine centres. TN returnees,https://health.odisha.gov.in/covid19-dashboard.html,,,,,,57170
28235,,24/05/2020,,,,Dhenkanal,Odisha,OR,1,Hospitalized,,In quarantine centre. Surat returnee,https://health.odisha.gov.in/covid19-dashboard.html,,,,,,57171
28236,,24/05/2020,,,,Nuapada,Odisha,OR,1,Hospitalized,,In quarantine centre. Maharashtra returnee,https://health.odisha.gov.in/covid19-dashboard.html,,,,,,57172
28237,,24/05/2020,,,,Chirang,Assam,AS,2,Hospitalized,,Travel history from Chennai,https://twitter.com/himantabiswa/status/1264405608955961344?s=20,,,,,,57173
28238,,24/05/2020,,,,Jorhat,Assam,AS,2,Hospitalized,,Travel history from Chennai,https://twitter.com/himantabiswa/status/1264405608955961344?s=20,,,,,,57174
28239,,24/05/2020,,,,Ajmer,Rajasthan,RJ,19,Hospitalized,,,https://twitter.com/ANI/status/1264407172466610176?s=09,https://twitter.com/PIBJaipur/status/1264506191482204160?s=20,,,,,57175
28240,,24/05/2020,,,,Barmer,Rajasthan,RJ,6,Hospitalized,,,https://twitter.com/ANI/status/1264407172466610176?s=09,https://twitter.com/PIBJaipur/status/1264506191482204160?s=20,,,,,57176
28241,,24/05/2020,,,,Bikaner,Rajasthan,RJ,3,Hospitalized,,,https://twitter.com/ANI/status/1264407172466610176?s=09,https://twitter.com/PIBJaipur/status/1264506191482204160?s=20,,,,,57177
28242,,24/05/2020,,,,Dausa,Rajasthan,RJ,1,Hospitalized,,,https://twitter.com/ANI/status/1264407172466610176?s=09,https://twitter.com/PIBJaipur/status/1264506191482204160?s=20,,,,,57178
28243,,24/05/2020,,,,Dungarpur,Rajasthan,RJ,4,Hospitalized,,,https://twitter.com/ANI/status/1264407172466610176?s=09,https://twitter.com/PIBJaipur/status/1264506191482204160?s=20,,,,,57179
28244,,24/05/2020,,,,Jaipur,Rajasthan,RJ,24,Hospitalized,,,https://twitter.com/ANI/status/1264407172466610176?s=09,https://twitter.com/PIBJaipur/status/1264506191482204160?s=20,,,,,57180
28245,,24/05/2020,,,,Jhunjhunu,Rajasthan,RJ,1,Hospitalized,,,https://twitter.com/ANI/status/1264407172466610176?s=09,https://twitter.com/PIBJaipur/status/1264506191482204160?s=20,,,,,57181
28246,,24/05/2020,,,,Jodhpur,Rajasthan,RJ,27,Hospitalized,,,https://twitter.com/ANI/status/1264407172466610176?s=09,https://twitter.com/PIBJaipur/status/1264506191482204160?s=20,,,,,57182
28247,,24/05/2020,,,,Kota,Rajasthan,RJ,1,Hospitalized,,,https://twitter.com/ANI/status/1264407172466610176?s=09,https://twitter.com/PIBJaipur/status/1264506191482204160?s=20,,,,,57183
28248,,24/05/2020,,,,Nagaur,Rajasthan,RJ,5,Hospitalized,,,https://twitter.com/ANI/status/1264407172466610176?s=09,https://twitter.com/PIBJaipur/status/1264506191482204160?s=20,,,,,57184
28249,,24/05/2020,,,,Kota,Rajasthan,RJ,11,Recovered,,,https://twitter.com/ANI/status/1264407172466610176?s=09,https://twitter.com/PIBJaipur/status/1264506191482204160?s=20,,,,,57185
28250,,24/05/2020,,,,Nagaur,Rajasthan,RJ,3,Recovered,,,https://twitter.com/ANI/status/1264407172466610176?s=09,https://twitter.com/PIBJaipur/status/1264506191482204160?s=20,,,,,57186
28251,,24/05/2020,,,,Chittorgarh,Rajasthan,RJ,4,Recovered,,,https://twitter.com/ANI/status/1264407172466610176?s=09,https://twitter.com/PIBJaipur/status/1264506191482204160?s=20,,,,,57187
28252,,24/05/2020,,,,Chittorgarh,Rajasthan,RJ,1,Deceased,,,https://twitter.com/ANI/status/1264407172466610176?s=09,https://twitter.com/PIBJaipur/status/1264506191482204160?s=20,,,,,57188
28253,,24/05/2020,,,,,Goa,GA,11,Hospitalized,,Travelled to Goa in the Delhi-Thiruvananthapuram Rajdhani,https://twitter.com/visrane/status/1264408211131478016?s=20,,,,,,57189
28254,,24/05/2020,12,M,,Chandigarh,Chandigarh,CH,1,Hospitalized,,,,,,,,,57190
28255,,24/05/2020,13,M,,Chandigarh,Chandigarh,CH,1,Hospitalized,,,,,,,,,57191
28256,,24/05/2020,17,M,,Chandigarh,Chandigarh,CH,1,Hospitalized,,,,,,,,,57192
28257,,24/05/2020,15,F,,Chandigarh,Chandigarh,CH,1,Hospitalized,,,,,,,,,57193
28258,,24/05/2020,35,F,,Chandigarh,Chandigarh,CH,1,Hospitalized,,,,,,,,,57194
28259,,24/05/2020,24,M,,Chandigarh,Chandigarh,CH,1,Hospitalized,,,,,,,,,57195
28260,,24/05/2020,42,M,,Chandigarh,Chandigarh,CH,1,Hospitalized,,,,,,,,,57196
28261,,24/05/2020,14,F,,Chandigarh,Chandigarh,CH,1,Hospitalized,,,,,,,,,57197
28262,,24/05/2020,18,M,,Chandigarh,Chandigarh,CH,1,Hospitalized,,,,,,,,,57198
28263,,24/05/2020,23,F,,Chandigarh,Chandigarh,CH,1,Hospitalized,,,,,,,,,57199
28264,,24/05/2020,37,F,,Chandigarh,Chandigarh,CH,1,Hospitalized,,,,,,,,,57200
28265,,24/05/2020,30,F,,Chandigarh,Chandigarh,CH,1,Hospitalized,,,,,,,,,57201
28266,,24/05/2020,30,F,,Chandigarh,Chandigarh,CH,1,Hospitalized,,,,,,,,,57202
28267,,24/05/2020,29,M,,Rohtas,Bihar,BR,1,Hospitalized,,,https://twitter.com/BiharHealthDept/status/1264444998033960967?s=19,,,,,,57203
28268,,24/05/2020,22,M,,Rohtas,Bihar,BR,1,Hospitalized,,,https://twitter.com/BiharHealthDept/status/1264444998033960967?s=19,,,,,,57204
28269,,24/05/2020,20,M,,Rohtas,Bihar,BR,1,Hospitalized,,,https://twitter.com/BiharHealthDept/status/1264444998033960967?s=19,,,,,,57205
28270,,24/05/2020,24,M,,Rohtas,Bihar,BR,1,Hospitalized,,,https://twitter.com/BiharHealthDept/status/1264444998033960967?s=19,,,,,,57206
28271,,24/05/2020,35,M,,Rohtas,Bihar,BR,1,Hospitalized,,,https://twitter.com/BiharHealthDept/status/1264444998033960967?s=19,,,,,,57207
28272,,24/05/2020,19,M,,Rohtas,Bihar,BR,1,Hospitalized,,,https://twitter.com/BiharHealthDept/status/1264444998033960967?s=19,,,,,,57208
28273,,24/05/2020,25,M,,Rohtas,Bihar,BR,1,Hospitalized,,,https://twitter.com/BiharHealthDept/status/1264444998033960967?s=19,,,,,,57209
28274,,24/05/2020,35,M,,Rohtas,Bihar,BR,1,Hospitalized,,,https://twitter.com/BiharHealthDept/status/1264444998033960967?s=19,,,,,,57210
28275,,24/05/2020,23,M,,Rohtas,Bihar,BR,1,Hospitalized,,,https://twitter.com/BiharHealthDept/status/1264444998033960967?s=19,,,,,,57211
28276,,24/05/2020,19,M,,Rohtas,Bihar,BR,1,Hospitalized,,,https://twitter.com/BiharHealthDept/status/1264444998033960967?s=19,,,,,,57212
28277,,24/05/2020,29,M,,Rohtas,Bihar,BR,1,Hospitalized,,,https://twitter.com/BiharHealthDept/status/1264444998033960967?s=19,,,,,,57213
28278,,24/05/2020,28,M,,Kaimur,Bihar,BR,1,Hospitalized,,,https://twitter.com/BiharHealthDept/status/1264444998033960967?s=19,,,,,,57214
28279,,24/05/2020,30,M,,Kaimur,Bihar,BR,1,Hospitalized,,,https://twitter.com/BiharHealthDept/status/1264444998033960967?s=19,,,,,,57215
28280,,24/05/2020,40,M,,Kaimur,Bihar,BR,1,Hospitalized,,,https://twitter.com/BiharHealthDept/status/1264444998033960967?s=19,,,,,,57216
28281,,24/05/2020,32,M,,Arwal,Bihar,BR,1,Hospitalized,,,https://twitter.com/BiharHealthDept/status/1264444998033960967?s=19,,,,,,57217
28282,,24/05/2020,18,M,,Jehanabad,Bihar,BR,1,Hospitalized,,,https://twitter.com/BiharHealthDept/status/1264444998033960967?s=19,,,,,,57218
28283,,24/05/2020,44,M,,Nawada,Bihar,BR,1,Hospitalized,,,https://twitter.com/BiharHealthDept/status/1264444998033960967?s=19,,,,,,57219
28284,,24/05/2020,60,M,,Aurangabad,Bihar,BR,1,Hospitalized,,,https://twitter.com/BiharHealthDept/status/1264444998033960967?s=19,,,,,,57220
28285,,24/05/2020,17,M,,Aurangabad,Bihar,BR,1,Hospitalized,,,https://twitter.com/BiharHealthDept/status/1264444998033960967?s=19,,,,,,57221
28286,,24/05/2020,26,F,,Nalanda,Bihar,BR,1,Hospitalized,,,https://twitter.com/BiharHealthDept/status/1264444998033960967?s=19,,,,,,57222
28287,,24/05/2020,28,M,,Nalanda,Bihar,BR,1,Hospitalized,,,https://twitter.com/BiharHealthDept/status/1264444998033960967?s=19,,,,,,57223
28288,,24/05/2020,32,M,,Gopalganj,Bihar,BR,1,Hospitalized,,,https://twitter.com/BiharHealthDept/status/1264444998033960967?s=19,,,,,,57224
28289,,24/05/2020,17,M,,Gopalganj,Bihar,BR,1,Hospitalized,,,https://twitter.com/BiharHealthDept/status/1264444998033960967?s=19,,,,,,57225
28290,,24/05/2020,45,M,,Katihar,Bihar,BR,1,Hospitalized,,,https://twitter.com/BiharHealthDept/status/1264444998033960967?s=19,,,,,,57226
28291,,24/05/2020,28,M,,Begusarai,Bihar,BR,1,Hospitalized,,,https://twitter.com/BiharHealthDept/status/1264444998033960967?s=19,,,,,,57227
28292,,24/05/2020,50,M,,Begusarai,Bihar,BR,1,Hospitalized,,,https://twitter.com/BiharHealthDept/status/1264444998033960967?s=19,,,,,,57228
28293,,24/05/2020,30,M,,Begusarai,Bihar,BR,1,Hospitalized,,,https://twitter.com/BiharHealthDept/status/1264444998033960967?s=19,,,,,,57229
28294,,24/05/2020,30,M,,Begusarai,Bihar,BR,1,Hospitalized,,,https://twitter.com/BiharHealthDept/status/1264444998033960967?s=19,,,,,,57230
28295,,24/05/2020,36,M,,Begusarai,Bihar,BR,1,Hospitalized,,,https://twitter.com/BiharHealthDept/status/1264444998033960967?s=19,,,,,,57231
28296,,24/05/2020,26,M,,Begusarai,Bihar,BR,1,Hospitalized,,,https://twitter.com/BiharHealthDept/status/1264444998033960967?s=19,,,,,,57232
28297,,24/05/2020,30,M,,Begusarai,Bihar,BR,1,Hospitalized,,,https://twitter.com/BiharHealthDept/status/1264444998033960967?s=19,,,,,,57233
28298,,24/05/2020,49,M,,Begusarai,Bihar,BR,1,Hospitalized,,,https://twitter.com/BiharHealthDept/status/1264444998033960967?s=19,,,,,,57234
28299,,24/05/2020,33,M,,Bhagalpur,Bihar,BR,1,Hospitalized,,,https://twitter.com/BiharHealthDept/status/1264444998033960967?s=19,,,,,,57235
28300,,24/05/2020,32,M,,Bhagalpur,Bihar,BR,1,Hospitalized,,,https://twitter.com/BiharHealthDept/status/1264444998033960967?s=19,,,,,,57236
28301,,24/05/2020,16,M,,Madhubani,Bihar,BR,1,Hospitalized,,,https://twitter.com/BiharHealthDept/status/1264444998033960967?s=19,,,,,,57237
28302,,24/05/2020,23,M,,Madhubani,Bihar,BR,1,Hospitalized,,,https://twitter.com/BiharHealthDept/status/1264444998033960967?s=19,,,,,,57238
28303,,24/05/2020,51,M,,Madhubani,Bihar,BR,1,Hospitalized,,,https://twitter.com/BiharHealthDept/status/1264444998033960967?s=19,,,,,,57239
28304,,24/05/2020,22,M,,Khagaria,Bihar,BR,1,Hospitalized,,,https://twitter.com/BiharHealthDept/status/1264444998033960967?s=19,,,,,,57240
28305,,24/05/2020,58,M,,Khagaria,Bihar,BR,1,Hospitalized,,,https://twitter.com/BiharHealthDept/status/1264444998033960967?s=19,,,,,,57241
28306,,24/05/2020,24,M,,Banka,Bihar,BR,1,Hospitalized,,,https://twitter.com/BiharHealthDept/status/1264444998033960967?s=19,,,,,,57242
28307,,24/05/2020,19,M,,Banka,Bihar,BR,1,Hospitalized,,,https://twitter.com/BiharHealthDept/status/1264444998033960967?s=19,,,,,,57243
28308,,24/05/2020,28,M,,Begusarai,Bihar,BR,1,Hospitalized,,,https://twitter.com/BiharHealthDept/status/1264444998033960967?s=19,,,,,,57244
28309,,24/05/2020,23,M,,Gopalganj,Bihar,BR,1,Hospitalized,,,https://twitter.com/BiharHealthDept/status/1264444998033960967?s=19,,,,,,57245
28310,,24/05/2020,23,M,,Munger,Bihar,BR,1,Hospitalized,,,https://twitter.com/BiharHealthDept/status/1264444998033960967?s=19,,,,,,57246
28311,,24/05/2020,17,M,,Munger,Bihar,BR,1,Hospitalized,,,https://twitter.com/BiharHealthDept/status/1264444998033960967?s=19,,,,,,57247
28312,,24/05/2020,8,M,,Munger,Bihar,BR,1,Hospitalized,,,https://twitter.com/BiharHealthDept/status/1264444998033960967?s=19,,,,,,57248
28313,,24/05/2020,35,M,,Munger,Bihar,BR,1,Hospitalized,,,https://twitter.com/BiharHealthDept/status/1264444998033960967?s=19,,,,,,57249
28314,,24/05/2020,25,M,,Munger,Bihar,BR,1,Hospitalized,,,https://twitter.com/BiharHealthDept/status/1264444998033960967?s=19,,,,,,57250
28315,,24/05/2020,30,M,,Munger,Bihar,BR,1,Hospitalized,,,https://twitter.com/BiharHealthDept/status/1264444998033960967?s=19,,,,,,57251
28316,,24/05/2020,40,M,,Katihar,Bihar,BR,1,Hospitalized,,,https://twitter.com/BiharHealthDept/status/1264444998033960967?s=19,,,,,,57252
28317,,24/05/2020,20,M,,Katihar,Bihar,BR,1,Hospitalized,,,https://twitter.com/BiharHealthDept/status/1264444998033960967?s=19,,,,,,57253
28318,,24/05/2020,23,M,,Katihar,Bihar,BR,1,Hospitalized,,,https://twitter.com/BiharHealthDept/status/1264444998033960967?s=19,,,,,,57254
28319,,24/05/2020,17,M,,Katihar,Bihar,BR,1,Hospitalized,,,https://twitter.com/BiharHealthDept/status/1264444998033960967?s=19,,,,,,57255
28320,,24/05/2020,44,M,,Katihar,Bihar,BR,1,Hospitalized,,,https://twitter.com/BiharHealthDept/status/1264444998033960967?s=19,,,,,,57256
28321,,24/05/2020,31,M,,Katihar,Bihar,BR,1,Hospitalized,,,https://twitter.com/BiharHealthDept/status/1264444998033960967?s=19,,,,,,57257
28322,,24/05/2020,18,M,,Katihar,Bihar,BR,1,Hospitalized,,,https://twitter.com/BiharHealthDept/status/1264444998033960967?s=19,,,,,,57258
28323,,24/05/2020,34,F,,Katihar,Bihar,BR,1,Hospitalized,,,https://twitter.com/BiharHealthDept/status/1264444998033960967?s=19,,,,,,57259
28324,,24/05/2020,42,M,,Katihar,Bihar,BR,1,Hospitalized,,,https://twitter.com/BiharHealthDept/status/1264444998033960967?s=19,,,,,,57260
28325,,24/05/2020,24,M,,Katihar,Bihar,BR,1,Hospitalized,,,https://twitter.com/BiharHealthDept/status/1264444998033960967?s=19,,,,,,57261
28326,,24/05/2020,45,M,,Katihar,Bihar,BR,1,Hospitalized,,,https://twitter.com/BiharHealthDept/status/1264444998033960967?s=19,,,,,,57262
28327,,24/05/2020,29,M,,Katihar,Bihar,BR,1,Hospitalized,,,https://twitter.com/BiharHealthDept/status/1264444998033960967?s=19,,,,,,57263
28328,,24/05/2020,46,M,,Katihar,Bihar,BR,1,Hospitalized,,,https://twitter.com/BiharHealthDept/status/1264444998033960967?s=19,,,,,,57264
28329,,24/05/2020,30,M,,Katihar,Bihar,BR,1,Hospitalized,,,https://twitter.com/BiharHealthDept/status/1264444998033960967?s=19,,,,,,57265
28330,,24/05/2020,45,M,,Katihar,Bihar,BR,1,Hospitalized,,,https://twitter.com/BiharHealthDept/status/1264444998033960967?s=19,,,,,,57266
28331,,24/05/2020,33,M,,Katihar,Bihar,BR,1,Hospitalized,,,https://twitter.com/BiharHealthDept/status/1264444998033960967?s=19,,,,,,57267
28332,,24/05/2020,29,M,,Katihar,Bihar,BR,1,Hospitalized,,,https://twitter.com/BiharHealthDept/status/1264444998033960967?s=19,,,,,,57268
28333,,24/05/2020,50,M,,Katihar,Bihar,BR,1,Hospitalized,,,https://twitter.com/BiharHealthDept/status/1264444998033960967?s=19,,,,,,57269
28334,,24/05/2020,40,M,,Katihar,Bihar,BR,1,Hospitalized,,,https://twitter.com/BiharHealthDept/status/1264444998033960967?s=19,,,,,,57270
28335,,24/05/2020,20,M,,Katihar,Bihar,BR,1,Hospitalized,,,https://twitter.com/BiharHealthDept/status/1264444998033960967?s=19,,,,,,57271
28336,,24/05/2020,19,M,,Katihar,Bihar,BR,1,Hospitalized,,,https://twitter.com/BiharHealthDept/status/1264444998033960967?s=19,,,,,,57272
28337,,24/05/2020,45,M,,Katihar,Bihar,BR,1,Hospitalized,,,https://twitter.com/BiharHealthDept/status/1264444998033960967?s=19,,,,,,57273
28338,,24/05/2020,50,M,,Katihar,Bihar,BR,1,Hospitalized,,,https://twitter.com/BiharHealthDept/status/1264444998033960967?s=19,,,,,,57274
28339,,24/05/2020,25,M,,Katihar,Bihar,BR,1,Hospitalized,,,https://twitter.com/BiharHealthDept/status/1264444998033960967?s=19,,,,,,57275
28340,,24/05/2020,22,M,,Katihar,Bihar,BR,1,Hospitalized,,,https://twitter.com/BiharHealthDept/status/1264444998033960967?s=19,,,,,,57276
28341,,24/05/2020,27,M,,Katihar,Bihar,BR,1,Hospitalized,,,https://twitter.com/BiharHealthDept/status/1264444998033960967?s=19,,,,,,57277
28342,,24/05/2020,24,M,,Katihar,Bihar,BR,1,Hospitalized,,,https://twitter.com/BiharHealthDept/status/1264444998033960967?s=19,,,,,,57278
28343,,24/05/2020,26,M,,Katihar,Bihar,BR,1,Hospitalized,,,https://twitter.com/BiharHealthDept/status/1264444998033960967?s=19,,,,,,57279
28344,,24/05/2020,40,M,,Katihar,Bihar,BR,1,Hospitalized,,,https://twitter.com/BiharHealthDept/status/1264444998033960967?s=19,,,,,,57280
28345,,24/05/2020,47,M,,Katihar,Bihar,BR,1,Hospitalized,,,https://twitter.com/BiharHealthDept/status/1264444998033960967?s=19,,,,,,57281
28346,,24/05/2020,35,M,,Katihar,Bihar,BR,1,Hospitalized,,,https://twitter.com/BiharHealthDept/status/1264444998033960967?s=19,,,,,,57282
28347,,24/05/2020,28,M,,Katihar,Bihar,BR,1,Hospitalized,,,https://twitter.com/BiharHealthDept/status/1264444998033960967?s=19,,,,,,57283
28348,,24/05/2020,30,M,,Katihar,Bihar,BR,1,Hospitalized,,,https://twitter.com/BiharHealthDept/status/1264444998033960967?s=19,,,,,,57284
28349,,24/05/2020,40,M,,Katihar,Bihar,BR,1,Hospitalized,,,https://twitter.com/BiharHealthDept/status/1264444998033960967?s=19,,,,,,57285
28350,,24/05/2020,,,,,Delhi,DL,508,Hospitalized,,,https://t.me/indiacovid/5444,,,,,,57286
28351,,24/05/2020,,,,,Delhi,DL,273,Recovered,,,https://t.me/indiacovid/5444,,,,,,57287
28352,,24/05/2020,,,,,Delhi,DL,30,Deceased,,,https://t.me/indiacovid/5444,,,,,,57288
28353,,24/05/2020,,,,,Andhra Pradesh,AP,66,Hospitalized,,,https://t.me/indiacovid/5438,,,,,,57289
28354,,24/05/2020,,,,,Andhra Pradesh,AP,29,Recovered,,,https://t.me/indiacovid/5438,,,,,,57290
28355,,24/05/2020,,,,Kargil,Ladakh,LA,3,Hospitalized,,,https://twitter.com/ladags/status/1264478443887923203?s=19,,,,,,57291
28357,,24/05/2020,,,,,Manipur,MN,3,Hospitalized,,,https://twitter.com/ANI/status/1264451912960634880,,,,,,57293
28358,,24/05/2020,,,,,Andhra Pradesh,AP,33,Recovered,,To reconcile total active cases (762 domicile cases + 119 Other state cases = 883 active),https://t.me/indiacovid/5438,,,,,,57294
28359,,24/05/2020,,,,Ganjam,Odisha,OR,30,Recovered,,,https://twitter.com/HFWOdisha/status/1264481504241029120?s=19,,,,,,57295
28360,,24/05/2020,,,,Jajpur,Odisha,OR,18,Recovered,,,https://twitter.com/HFWOdisha/status/1264481504241029120?s=19,,,,,,57296
28361,,24/05/2020,,,,Khordha,Odisha,OR,3,Recovered,,,https://twitter.com/HFWOdisha/status/1264481504241029120?s=19,,,,,,57297
28362,,24/05/2020,,,,Kendujhar,Odisha,OR,2,Recovered,,,https://twitter.com/HFWOdisha/status/1264481504241029120?s=19,,,,,,57298
28363,,24/05/2020,,,,Faridabad,Haryana,HR,11,Hospitalized,,,http://www.nhmharyana.gov.in/WriteReadData/userfiles/file/CoronaVirus/Daily%20Bulletin%20of%20COVID%2019%20as%20on%2024-05-2020%20morning.pdf,,,,,,57299
28364,,24/05/2020,,,,Jhajjar,Haryana,HR,2,Hospitalized,,,http://www.nhmharyana.gov.in/WriteReadData/userfiles/file/CoronaVirus/Daily%20Bulletin%20of%20COVID%2019%20as%20on%2024-05-2020%20morning.pdf,,,,,,57300
28365,,24/05/2020,,,,Rohtak,Haryana,HR,1,Hospitalized,,,http://www.nhmharyana.gov.in/WriteReadData/userfiles/file/CoronaVirus/Daily%20Bulletin%20of%20COVID%2019%20as%20on%2024-05-2020%20morning.pdf,,,,,,57301
28366,,24/05/2020,,,,Hisar,Haryana,HR,7,Hospitalized,,,http://www.nhmharyana.gov.in/WriteReadData/userfiles/file/CoronaVirus/Daily%20Bulletin%20of%20COVID%2019%20as%20on%2024-05-2020%20morning.pdf,,,,,,57302
28367,,24/05/2020,,,,Fatehabad,Haryana,HR,1,Recovered,,,http://www.nhmharyana.gov.in/WriteReadData/userfiles/file/CoronaVirus/Daily%20Bulletin%20of%20COVID%2019%20as%20on%2024-05-2020%20morning.pdf,,,,,,57303
28368,,24/05/2020,,,,,Himachal Pradesh,HP,6,Hospitalized,,,https://twitter.com/ANI/status/1264456319546753024,,,,,,57304
28369,,24/05/2020,,,,Bilaspur,Himachal Pradesh,HP,2,Recovered,,,https://twitter.com/ANI/status/1264456319546753024,https://twitter.com/nhm_hp/status/1264531382505701376/photo/2,,,,,57305
28370,,24/05/2020,,,,,Uttarakhand,UT,54,Hospitalized,,,https://twitter.com/ANI/status/1264494948105064451,,,,,,57306
28371,,24/05/2020,,,,Uttarkashi,Uttarakhand,UT,1,Recovered,,,https://twitter.com/ANI/status/1264494948105064451,,,,,,57307
28372,,24/05/2020,,,,Dehradun,Uttarakhand,UT,2,Deceased,,,https://twitter.com/ANI/status/1264494948105064451,,,,,,57308
28373,,24/05/2020,,,,,Uttarakhand,UT,1,Migrated_Other,,Reduced from active count,https://twitter.com/ANI/status/1264494948105064451,,,,,,57309
28374,KA-P1960,24/05/2020,32,M,,Chikkaballapura,Karnataka,KA,1,Hospitalized,,Travelled from Maharashtra,https://twitter.com/DHFWKA/status/1264532272293638144,,,,,,57310
28375,KA-P1961,24/05/2020,35,F,,Udupi,Karnataka,KA,1,Hospitalized,,Travelled from Maharashtra,https://twitter.com/DHFWKA/status/1264532272293638144,,,,,,57311
28376,KA-P1962,24/05/2020,60,F,,Davanagere,Karnataka,KA,1,Hospitalized,,Contact of Containment zone Davanagere,https://twitter.com/DHFWKA/status/1264532272293638144,,,,,,57312
28377,KA-P1963,24/05/2020,33,F,,Davanagere,Karnataka,KA,1,Hospitalized,,Contact of P-1251,https://twitter.com/DHFWKA/status/1264532272293638144,,,,,,57313
28378,KA-P1964,24/05/2020,33,F,,Davanagere,Karnataka,KA,1,Hospitalized,,Contact of P-1251,https://twitter.com/DHFWKA/status/1264532272293638144,,,,,,57314
28379,KA-P1965,24/05/2020,32,M,,Kalaburagi,Karnataka,KA,1,Hospitalized,,Travelled from Maharashtra,https://twitter.com/DHFWKA/status/1264532272293638144,,,,,,57315
28380,KA-P1966,24/05/2020,20,M,,Kalaburagi,Karnataka,KA,1,Hospitalized,,Travelled from Maharashtra,https://twitter.com/DHFWKA/status/1264532272293638144,,,,,,57316
28381,KA-P1967,24/05/2020,48,M,,Kalaburagi,Karnataka,KA,1,Hospitalized,,Travelled from Maharashtra,https://twitter.com/DHFWKA/status/1264532272293638144,,,,,,57317
28382,KA-P1968,24/05/2020,50,F,,Kalaburagi,Karnataka,KA,1,Hospitalized,,Travelled from Maharashtra,https://twitter.com/DHFWKA/status/1264532272293638144,,,,,,57318
28383,KA-P1969,24/05/2020,12,M,,Chikkaballapura,Karnataka,KA,1,Hospitalized,,Travelled from Maharashtra,https://twitter.com/DHFWKA/status/1264532272293638144,,,,,,57319
28384,KA-P1970,24/05/2020,22,M,,Tumakuru,Karnataka,KA,1,Hospitalized,,Travelled from Gujarat & Contact of P-792,https://twitter.com/DHFWKA/status/1264532272293638144,,,,,,57320
28385,KA-P1971,24/05/2020,50,M,,Tumakuru,Karnataka,KA,1,Hospitalized,,Travelled from Maharashtra,https://twitter.com/DHFWKA/status/1264532272293638144,,,,,,57321
28386,KA-P1972,24/05/2020,4,F,,Yadgir,Karnataka,KA,1,Hospitalized,,Travelled from Maharashtra,https://twitter.com/DHFWKA/status/1264532272293638144,,,,,,57322